program: Gaussian 09
title: 000291946
version: EM64L-G09RevD.01
frameworkgroup: C1[X(C14H15ClN4)]
method: RPBEPBE
basis: SDD
operation: Freq
keyword: #p
keyword: freq=noraman
keyword: PBEPBE/SDD
title: #p freq=noraman PBEPBE/SDD
converged: YES YES NO NO
title: Mulliken charges:
elementType: Cl N N N N C C C C C C C C C C C C C C H H H H H H H H H H H H H H H
charge: -0.055997 -0.078466 -0.073709 -0.627830 -0.622094 0.061744 0.032147 0.308089 0.189386 0.089210 0.094356 -0.405152 -0.374900 -0.784070 -0.808109 -0.229493 -0.211143 -0.119500 -0.391696 0.256490 0.259583 0.223604 0.222572 0.262989 0.260885 0.225106 0.228529 0.255971 0.256802 0.325538 0.327094 0.325811 0.337107 0.239147
chargesum: 0.00000
title: Mulliken charges with hydrogens summed into heavy atoms:
elementType: Cl N N N N C C C C C C C C C C C C C C
charge: -0.055997 -0.078466 -0.073709 0.024801 0.040824 0.061744 0.032147 0.308089 0.189386 0.089210 0.094356 -0.148662 -0.115317 -0.074905 -0.093589 0.026478 0.045659 -0.119500 -0.152550
polarizability: 2.46682446e+02 7.33537581e+00 1.93420555e+02 -1.59277472e+01 6.28431587e+00 1.49917153e+02
1716.lowfreq: -11.4776 -0.0014 -0.0013 0.0006 4.5097 7.2806 29.0508 44.1523 57.2317
frequency: 28.6504 44.1195 57.1824 72.6125 98.1263 109.3268 133.7924 150.4539 171.2705 207.2731 208.4217 228.8317 253.0793 285.5020 312.8456 334.1089 365.0837 379.1827 393.9369 414.1653 425.3434 429.1513 439.1558 469.3648 484.3014 504.5576 531.9861 540.4066 546.3865 564.1874 588.4528 619.9403 656.5977 671.5557 699.1375 722.8414 787.5939 810.6545 834.1528 840.1880 879.5796 889.2439 948.9495 953.6745 958.1896 960.6535 967.1293 972.7866 973.5664 998.3818 1057.8125 1074.7359 1078.7810 1109.7351 1135.9946 1182.3117 1187.0397 1219.7883 1268.4834 1294.6427 1296.0535 1319.3343 1339.0351 1355.5665 1390.5357 1392.7499 1401.0435 1428.0837 1452.1861 1462.3185 1470.1746 1473.8043 1477.2850 1478.9107 1530.2176 1543.1419 1570.9701 1592.4189 1597.2695 1610.0011 1623.8203 2960.7045 2964.9553 3029.9818 3032.4869 3095.1173 3101.9686 3140.8184 3143.7214 3149.3579 3167.5597 3171.8749 3543.5324 3545.1832 3698.5369 3700.0850
redmass: 5.9543 7.2140 3.7582 4.7854 3.9307 3.1369 2.6322 3.3328 1.4050 5.4813 6.7399 1.2693 4.5936 4.3341 3.9584 3.5106 3.1264 3.2907 2.7207 2.6036 1.3160 3.1941 1.2059 3.2182 3.5110 3.6768 1.2354 6.7766 1.1805 2.4400 5.4749 6.8277 5.4603 11.1060 6.8871 3.7821 10.2437 3.8301 1.2651 1.8363 4.1167 6.0794 1.4361 1.5963 1.6610 1.3618 1.4455 1.4935 1.7333 3.9581 1.8878 2.3892 1.6795 1.3795 2.7070 2.6911 1.1826 4.2540 4.0249 1.3829 4.2772 5.7284 1.8768 5.7249 1.2412 3.4806 1.2275 2.2178 1.1250 1.0622 1.1128 2.3808 1.1268 2.5924 6.9405 3.5903 7.2306 5.9681 1.5195 1.4461 5.0207 1.0394 1.0395 1.0959 1.0953 1.0971 1.0969 1.0885 1.0889 1.0918 1.0957 1.0966 1.0439 1.0444 1.1048 1.1051
irintensity: 0.7427 1.8872 0.2744 0.3234 1.7093 0.3302 0.8595 0.5372 1.3780 0.5344 0.8915 1.0094 1.1428 3.9086 4.7365 4.6910 9.2276 8.6536 10.7466 4.3547 132.7649 2.4371 252.9159 6.0952 7.5693 15.5190 40.8335 1.4817 5.4718 33.9906 2.8534 0.2520 4.7195 0.6639 14.4256 1.0820 11.9560 12.6988 6.6710 47.9525 4.8952 32.1347 8.7640 5.5855 5.4496 1.5092 3.2585 6.8156 6.6029 33.9754 26.6749 53.7414 0.4237 6.7761 11.0075 4.6143 0.9091 3.9663 1.2889 3.7308 23.6705 14.1028 13.7612 0.6076 16.1575 3.4573 19.6406 31.7870 23.8731 7.0332 3.4651 75.6646 11.1665 56.9309 117.4906 243.9728 0.9835 9.4572 438.3581 194.6501 12.9833 10.9284 70.2344 7.0432 30.9888 20.3166 13.4972 5.7723 4.3762 33.1937 6.7890 1.0446 117.4302 4.5726 45.5300 50.8135
temp: 298.150 k
press: 1.00000 atm
elementType: 17 7 7 7 7 6 6 6 6 6 6 6 6 6 6 6 6 6 6 1 1 1 1 1 1 1 1 1 1 1 1 1 1 1
symmnumber: 1
zpe: 698476.8 jmol-1
zpe.correction: 0.266036 hartree
zpe.thermalcorrener: 0.284367 hartree
zpe.thermalcorrenthalpy: 0.285311 hartree
zpe.thermalcorrgfe: 0.219374 hartree
zpe.sumelectzpe: -1220.210959 hartree
zpe.sumelectthermal: -1220.192628 hartree
zpe.sumelectthermalent: -1220.191684 hartree
zpe.sumelectthermalfe: -1220.257621 hartree
dipole: -0.6564 4.3999 0.1777
dipole: 4.4521
quadrupole: -137.6162 -115.5879 -109.2447
quadrupole: 7.4167 -6.4064 0.8763
quadrupole: -16.7999 5.2283 11.5716 7.4167 -6.4064 0.8763
hfenergy: -1220.4769951 hartree
pointgroup: C01 [X(C14H15Cl1N4)]
dipole: 0.4693905 -1.6855803 0.0811202 debye
polarizability: 237.753632|13.5367464|196.3457094|28.9381716|-0.9566881|155.9208119 unknown
InChI: InChI=1S/C14H15ClN4/c1-8(2)11(9-3-5-10(15)6-4-9)12-13(16)18-7-19-14(12)17/h3-7H,16-17H2,1-2H3
charge 0 multiplicity 1
34 atoms
Cl 5.34798 1.565967 0.410687
N  -3.145966 1.102862 -1.47279
N  -2.683326 1.916619 0.776902
N  -1.917895 -0.629847 -2.434242
N  -1.021615 0.97458 2.110743
C  -0.254742 -0.96286 0.004576
C  -1.364423 0.037955 -0.13473
C  1.126173 -0.380817 0.100306
C  -0.513564 -2.320971 0.022875
C  -2.138426 0.167616 -1.32988
C  -1.682407 0.971261 0.901978
C  2.100365 -0.87655 1.013737
C  1.477034 0.747724 -0.693888
C  -1.929883 -2.86748 0.049544
C  0.556088 -3.401261 -0.02064
C  3.382587 -0.29366 1.11454
C  2.754814 1.338957 -0.612267
C  3.694045 0.804732 0.291498
C  -3.353242 1.915607 -0.404029
H  1.849989 -1.714664 1.67285
H  0.737767 1.167362 -1.384443
H  -2.199516 -3.338716 -0.917251
H  -2.013677 -3.660501 0.81828
H  -2.676968 -2.087778 0.265776
H  1.540132 -3.022299 -0.339639
H  0.247032 -4.20206 -0.720488
H  0.680885 -3.888245 0.967509
H  4.118633 -0.680445 1.82542
H  3.012868 2.200317 -1.235086
H  -2.49141 -0.46576 -3.258357
H  -1.189903 -1.339076 -2.432537
H  -1.286925 1.68628 2.78823
H  -0.223719 0.369379 2.283652
H  -4.152288 2.657272 -0.508238
