program: Gaussian 09
title: 000292023
version: EM64L-G09RevD.01
frameworkgroup: C1[X(C13H10F3N3O4S)]
method: RPBEPBE
basis: SDD
operation: Freq
keyword: #p
keyword: freq=noraman
keyword: PBEPBE/SDD
title: #p freq=noraman PBEPBE/SDD
converged: YES YES NO NO
title: Mulliken charges:
elementType: S F F F O O O O N N N C C C C C C C C C C C C C H H H H H H H H H H
charge: 0.758698 -0.161528 -0.158888 -0.161538 -0.562154 -0.633355 -0.191665 -0.220222 -0.254317 -0.206681 0.025252 -0.109923 0.266283 -0.314391 -0.232175 0.335647 -0.450671 0.393801 -0.338769 -0.172504 -0.322578 -0.352815 -0.187561 0.273185 0.275293 0.295242 0.401756 0.304042 0.310887 0.300297 0.251959 0.272076 0.291355 0.275961
chargesum: 0.00000
title: Mulliken charges with hydrogens summed into heavy atoms:
elementType: S F F F O O O O N N N C C C C C C C C C C C C C
charge: 0.758698 -0.161528 -0.158888 -0.161538 -0.562154 -0.231600 -0.191665 -0.220222 0.020976 -0.206681 0.025252 -0.109923 0.266283 -0.019148 0.071867 0.335647 -0.139785 0.393801 -0.038473 0.079455 -0.050501 -0.061461 0.088400 0.273185
polarizability: 2.72576264e+02 -7.64153581e+00 2.73625896e+02 -7.55186673e+00 -7.31337881e+00 9.22898994e+01
1716.lowfreq: -2.9100 -0.0006 0.0017 0.0018 2.0048 5.6176 9.8031 12.7016 18.8835
frequency: 9.2078 12.4497 18.8113 26.5536 33.6200 51.6286 59.6975 65.1827 95.4165 123.6581 129.3223 139.0376 145.6695 164.3167 185.7559 221.3640 226.6377 242.1588 283.8022 304.9907 306.5426 313.4370 325.4965 371.8338 390.9911 416.2554 424.3126 429.2271 459.0433 468.7406 509.6439 515.2225 519.2140 549.1048 602.4050 607.0411 638.0031 645.1186 670.5313 684.9527 691.0572 695.3171 700.5091 803.6653 815.6478 822.4221 853.4005 865.7437 899.1959 918.7616 941.9517 956.3792 964.9583 972.4552 982.9978 987.2769 996.3083 1008.8162 1017.1043 1022.0530 1047.8012 1057.0055 1076.7502 1099.2590 1110.3023 1135.5037 1165.5329 1195.5198 1214.9313 1267.8206 1274.1591 1283.1942 1303.5756 1363.6828 1369.1512 1403.3779 1405.6394 1421.2064 1447.9333 1448.8334 1471.7862 1477.4744 1588.5003 1595.0104 1597.6794 1611.5314 2729.1040 3135.8488 3143.6236 3158.2690 3162.9568 3176.1013 3178.6190 3183.6058 3187.3408 3204.1507
redmass: 17.4429 9.4785 10.0945 6.5012 7.8918 10.4196 10.1543 9.9358 11.0092 6.7452 8.6717 7.5644 6.8232 6.4536 5.5766 9.8232 7.7131 7.6165 6.3820 7.6558 9.7509 6.9633 9.2204 8.0688 8.5392 4.5204 4.3739 5.0605 6.6945 5.0916 6.2412 10.7227 7.6472 13.1774 5.3002 10.6938 7.2952 6.1961 3.3269 9.4597 2.4067 6.5415 3.9896 9.5799 1.3808 1.3954 5.1657 17.1440 1.2415 1.4816 1.3917 1.2406 1.3525 1.5147 5.3226 5.2697 6.6035 1.3574 1.3581 4.6295 4.2228 1.9136 1.6942 3.1825 1.8497 2.0388 1.1190 1.1410 8.8685 1.3089 1.1651 3.5124 1.3814 2.0267 9.0920 8.1140 9.0008 2.9979 2.4516 2.5920 3.0939 2.3813 6.9113 6.1663 7.6821 6.3616 1.0766 1.0900 1.0920 1.0910 1.0922 1.0933 1.0984 1.0920 1.0966 1.0758
irintensity: 0.0870 0.2035 0.3365 0.4448 4.7001 0.2966 3.3912 3.6829 1.8995 2.9582 4.4806 7.6452 1.0718 12.5970 8.8890 5.2163 8.4435 1.6404 3.9563 1.8081 5.3475 13.6177 3.9855 8.0939 3.7063 8.7812 3.8786 9.8569 2.3884 13.4807 11.8421 6.8375 1.2767 79.8517 9.9786 18.1407 4.8426 25.5322 16.5761 7.3410 37.0161 8.4907 27.7834 16.8136 22.9404 57.1716 28.9302 81.1966 31.3036 14.1469 109.7577 165.0680 12.8617 72.1318 1.7473 1.7630 158.3019 2.8154 10.9448 105.0610 147.4437 19.9178 28.1361 12.0151 16.0826 107.2256 13.0641 5.3518 237.0007 10.2707 57.3321 374.0210 12.5642 38.7393 117.0682 2.7822 0.3537 52.1032 11.6142 35.5684 35.9063 11.2792 5.9947 4.1377 3.8770 23.4628 2330.6688 6.4639 13.2243 0.4169 9.1132 3.9840 4.4516 6.7518 3.7193 0.1645
temp: 298.150 k
press: 1.00000 atm
elementType: 16 9 9 9 8 8 8 8 7 7 7 6 6 6 6 6 6 6 6 6 6 6 6 6 1 1 1 1 1 1 1 1 1 1
symmnumber: 1
zpe: 574178.8 jmol-1
zpe.correction: 0.218693 hartree
zpe.thermalcorrener: 0.241918 hartree
zpe.thermalcorrenthalpy: 0.242862 hartree
zpe.thermalcorrgfe: 0.159865 hartree
zpe.sumelectzpe: -1662.165992 hartree
zpe.sumelectthermal: -1662.142767 hartree
zpe.sumelectthermalent: -1662.141823 hartree
zpe.sumelectthermalfe: -1662.224820 hartree
dipole: 2.0923 -0.6348 0.4488
dipole: 2.2321
quadrupole: -149.9967 -160.8279 -147.3828
quadrupole: 10.3334 5.2524 -2.2623
quadrupole: 2.7391 -8.0921 5.3530 10.3334 5.2524 -2.2623
hfenergy: -1662.3846847 hartree
pointgroup: C01 [X(C13H10F3N3O4S1)]
dipole: 0.7273564 -0.0053261 0.4920473 debye
polarizability: 253.6993226|-5.7093654|269.7159484|61.6049066|-2.8253842|115.0767882 unknown
InChI: InChI=1S/C7H5F3N2.C6H5NO4S/c8-7(9,10)5-2-1-3-6(4-5)12-11;8-7(9)5-2-1-3-6(4-5)12(10)11/h1-4,11H;1-4,10H
charge 0 multiplicity 1
34 atoms
S  2.216997 -1.702279 1.596838
F  -5.678615 -0.462473 -2.935647
F  -5.52187 -2.498329 -1.941748
F  -5.96038 -0.652038 -0.698735
O  3.623804 -2.510573 1.826904
O  1.822974 -1.597913 -0.214633
O  1.783469 4.731153 0.86549
O  0.232149 3.148828 0.327256
N  -0.911517 -3.990745 -1.098503
N  -0.493158 -2.775385 -0.94976
N  1.388602 3.507824 0.783778
C  2.765962 0.11516 1.615834
C  -1.464162 -1.733119 -1.186906
C  1.856007 1.108923 1.23404
C  4.086941 0.399198 1.999597
C  -3.712119 -0.911065 -1.585862
C  -2.842828 -1.997145 -1.395192
C  2.31891 2.440597 1.233043
C  -0.9679 -0.404966 -1.17678
C  4.516526 1.748734 2.002393
C  -3.230468 0.426611 -1.56788
C  3.635316 2.781752 1.618512
C  -1.857762 0.674985 -1.365441
C  -5.186693 -1.138495 -1.788779
H  -0.109107 -4.633572 -0.884641
H  0.83096 0.88905 0.926785
H  1.005153 -2.20478 -0.434677
H  4.754152 -0.431391 2.260925
H  -3.200423 -3.030743 -1.401259
H  0.106139 -0.240384 -1.036643
H  5.542386 1.992204 2.295194
H  -3.926743 1.259102 -1.711817
H  3.946259 3.829656 1.60328
H  -1.479964 1.701417 -1.343564
