program: Gaussian 09
title: 000291938
version: EM64L-G09RevD.01
frameworkgroup: C1[X(C11H13NO2)]
method: RPBEPBE
basis: SDD
operation: Freq
keyword: #p
keyword: freq=noraman
keyword: PBEPBE/SDD
title: #p freq=noraman PBEPBE/SDD
converged: YES YES NO NO
title: Mulliken charges:
elementType: O O N C C C C C C C C C C C H H H H H H H H H H H H H
charge: -0.237254 -0.260316 -0.282398 -0.376237 -0.444943 -0.303526 0.420127 0.252986 -0.341900 -0.324858 0.456294 -0.439604 -0.363379 -0.808971 0.217742 0.257240 0.244071 0.218714 0.238571 0.210007 0.236442 0.288092 0.228635 0.230047 0.234070 0.222014 0.228335
chargesum: 0.00000
title: Mulliken charges with hydrogens summed into heavy atoms:
elementType: O O N C C C C C C C C C C C
charge: -0.237254 -0.260316 -0.282398 0.098746 0.017841 0.145052 0.420127 0.252986 -0.105458 -0.036766 0.456294 -0.210970 -0.133331 -0.124552
polarizability: 1.94305953e+02 -3.83437498e+00 1.26878873e+02 -1.07474575e+00 8.54304201e+00 7.55740813e+01
1716.lowfreq: -5.3674 -0.0009 -0.0008 -0.0006 3.8008 6.4905 31.9972 47.9079 62.5919
frequency: 31.9753 47.8411 62.5901 100.3207 125.5351 163.9634 207.6726 274.8207 306.5814 323.9969 363.3820 400.6332 407.3917 464.0516 479.3880 506.3723 542.9545 597.5568 638.4184 662.0985 675.5839 713.7534 782.5311 812.2940 830.4393 842.4970 900.2415 905.2926 934.5493 951.4833 967.5318 981.2517 990.3940 1011.9604 1047.1882 1074.7416 1098.2696 1117.6540 1135.4713 1172.5996 1187.9626 1204.4772 1227.9233 1236.1831 1259.7679 1288.0528 1321.7273 1357.5422 1363.3917 1366.7099 1389.3560 1398.6345 1415.0255 1452.8269 1470.5148 1476.1647 1478.7875 1491.4629 1509.2591 1581.0062 1624.9989 1646.1034 2958.2541 2975.3076 2993.4592 3012.1641 3051.8492 3053.4672 3077.1040 3081.9241 3096.9783 3122.6679 3125.8169 3158.8732 3203.7338
redmass: 3.9754 1.0934 3.2277 3.4328 4.1299 4.1748 4.0516 5.5374 3.5977 1.9643 3.5846 4.0694 2.9158 4.6485 4.4367 3.3909 3.8699 3.6981 6.7928 3.1137 10.0423 3.1012 4.8280 1.4649 1.4682 3.6564 2.2677 1.4674 1.5248 2.3880 1.3603 2.3107 1.5979 2.7909 1.5432 4.0821 2.1992 1.8016 1.4122 2.1938 1.3398 1.1634 2.2215 2.4834 1.5131 1.6729 1.3239 1.4918 1.8645 1.9527 1.8125 1.2702 3.1142 1.0925 1.0480 1.1023 1.1006 1.1300 2.3684 6.0709 6.4853 11.0712 1.0671 1.0372 1.0670 1.0610 1.0955 1.0974 1.1021 1.0989 1.1015 1.0893 1.0904 1.0941 1.0937
irintensity: 3.9427 0.3643 0.1206 2.7956 1.0437 2.4552 2.7495 3.2379 2.6009 3.7537 7.4666 1.0168 0.8160 1.8833 2.5606 9.5949 13.1745 11.7653 0.3478 7.0490 13.1439 0.8308 3.2468 53.2532 17.6746 13.7731 1.7796 6.4247 6.7652 18.5257 0.7617 20.5056 23.3570 0.2249 13.9282 235.5102 170.7623 8.7444 18.6847 45.9452 16.8664 3.2631 5.9239 5.4395 152.5987 118.4767 13.6390 0.5916 2.8492 31.6095 43.5954 17.6533 2.5326 15.6296 12.1024 16.6240 36.2244 35.6203 111.9710 2.3878 31.9782 308.0457 36.8369 44.2839 57.0936 20.0478 18.2367 23.2775 34.6110 20.1696 31.8767 18.5691 22.5462 16.0466 1.1930
temp: 298.150 k
press: 1.00000 atm
elementType: 8 8 7 6 6 6 6 6 6 6 6 6 6 6 1 1 1 1 1 1 1 1 1 1 1 1 1
symmnumber: 1
zpe: 576078.2 jmol-1
zpe.correction: 0.219417 hartree
zpe.thermalcorrener: 0.232123 hartree
zpe.thermalcorrenthalpy: 0.233067 hartree
zpe.thermalcorrgfe: 0.179097 hartree
zpe.sumelectzpe: -631.140895 hartree
zpe.sumelectthermal: -631.128188 hartree
zpe.sumelectthermalent: -631.127244 hartree
zpe.sumelectthermalfe: -631.181214 hartree
dipole: 0.2105 -5.7871 0.8022
dipole: 5.8462
quadrupole: -67.9300 -86.2010 -83.6601
quadrupole: -13.7202 1.2350 4.1458
quadrupole: 11.3337 -6.9373 -4.3964 -13.7202 1.2350 4.1458
hfenergy: -631.3603113 hartree
pointgroup: C01 [X(C11H13N1O2)]
dipole: 0.046927 -2.2969982 0.1093672 debye
polarizability: 194.1894617|-4.8950214|125.0553993|-0.1319346|12.9882855|77.5140466 unknown
InChI: InChI=1S/C11H13NO2/c1-9-3-5-10(6-4-9)12-7-2-8-14-11(12)13/h3-6H,2,7-8H2,1H3
charge 0 multiplicity 1
27 atoms
O  3.225012 0.89622 -0.070483
O  1.367863 2.206672 -0.049974
N  1.039883 -0.129096 0.056527
C  1.64179 -1.494733 0.098004
C  3.080711 -1.457823 0.625026
C  3.862854 -0.437501 -0.196961
C  -0.407744 -0.066461 0.027848
C  1.819263 1.040497 -0.028405
C  -1.137294 -1.170201 -0.488231
C  -1.133265 1.044648 0.538203
C  -3.282749 -0.061506 0.010261
C  -2.549257 -1.161969 -0.49195
C  -2.541363 1.034938 0.522605
C  -4.801042 -0.041805 -0.007363
H  1.632101 -1.945131 -0.916401
H  1.006393 -2.121513 0.747413
H  3.097874 -1.171414 1.692103
H  3.533243 -2.461836 0.531653
H  4.892048 -0.286104 0.163975
H  3.890135 -0.716002 -1.26893
H  -0.619744 -2.037828 -0.908129
H  -0.595985 1.912612 0.920923
H  -3.084319 -2.027394 -0.901351
H  -3.076666 1.9048 0.923295
H  -5.18378 0.730701 -0.701493
H  -5.215319 -1.013232 -0.328284
H  -5.213945 0.188761 0.992417
