program: Gaussian 09
title: 000291978
version: EM64L-G09RevD.01
frameworkgroup: C1[X(C22H24ClN3O)]
method: RPBEPBE
basis: SDD
operation: Freq
keyword: #p
keyword: freq=noraman
keyword: PBEPBE/SDD
title: #p freq=noraman PBEPBE/SDD
converged: YES YES NO NO
title: Mulliken charges:
elementType: Cl O N N N C C C C C C C C C C C C C C C C C C C C C C H H H H H H H H H H H H H H H H H H H H H H H H
charge: -0.073369 -0.471822 -0.257541 -0.079284 -0.481667 -0.110359 -0.407981 -0.412782 -0.298161 -0.368087 -0.470445 0.403972 0.225331 -0.592051 -0.041305 -0.612017 0.183844 0.427925 -0.344004 -0.351151 -0.823391 0.444850 -0.454882 -0.314167 -0.188794 -0.210603 -0.118584 0.241939 0.212230 0.218519 0.192961 0.213389 0.241710 0.195191 0.194747 0.219865 0.202012 0.266243 0.265983 0.348455 0.250913 0.254196 0.234686 0.306963 0.231218 0.228816 0.230331 0.222144 0.322104 0.252095 0.249817
chargesum: 0.00000
title: Mulliken charges with hydrogens summed into heavy atoms:
elementType: Cl O N N N C C C C C C C C C C C C C C C C C C C C C C
charge: -0.073369 -0.123367 0.008702 -0.079284 -0.174704 0.131579 0.022768 -0.006432 -0.056451 0.021852 -0.048569 0.403972 0.225331 -0.326069 -0.041305 -0.361104 0.183844 0.427925 -0.089808 -0.116465 -0.133027 0.444850 -0.232738 0.007937 0.063301 0.039214 -0.118584
polarizability: 4.50685832e+02 5.11936697e+01 3.10907917e+02 1.33621961e+01 -2.92836480e+01 1.59966715e+02
1716.lowfreq: -9.7557 -0.0016 -0.0015 -0.0008 1.2966 3.6340 20.6562 32.3004 38.7582
frequency: 20.4081 32.0792 38.7408 43.1262 52.3058 61.3744 72.1350 85.7216 116.1545 130.6481 141.6563 157.7999 179.5001 205.1743 211.9230 217.3587 233.2148 247.6278 266.6451 296.5839 313.0381 325.7435 331.6849 333.8234 360.2740 373.4423 407.9844 414.3449 418.6224 437.3174 451.6645 460.0663 500.7609 512.4186 524.6409 530.9005 552.0953 584.6189 607.7755 617.6782 631.8633 663.1436 685.2236 688.0637 689.5355 702.9866 729.4840 756.5513 791.3637 798.9427 809.3600 819.4060 830.8663 836.9709 841.3935 845.7069 848.8476 884.7216 893.5721 900.2087 918.3446 932.4360 937.3592 942.0174 957.2468 977.4704 986.7826 991.3387 997.6655 1005.2223 1039.1203 1048.3676 1052.0445 1061.0422 1071.5876 1073.5683 1104.2950 1109.3738 1115.6576 1139.9081 1153.4788 1175.2638 1181.0762 1194.8924 1213.4526 1220.7840 1245.1842 1250.3537 1258.6395 1266.8165 1269.2810 1290.0818 1298.9682 1301.6820 1305.5638 1325.9077 1332.8014 1339.8522 1341.4024 1350.5099 1352.6107 1371.5618 1382.4202 1399.1500 1400.3807 1405.8632 1426.7183 1440.7985 1453.2210 1456.7536 1459.8586 1464.6900 1469.5343 1469.7485 1477.7158 1485.7217 1506.8719 1526.9683 1559.8245 1597.4595 1601.0020 1613.5974 1630.2319 2962.4055 2966.8260 2969.0281 2972.6774 2974.2000 2979.6709 2983.7781 3027.2880 3031.9890 3045.6620 3050.5538 3051.9587 3084.4555 3114.6997 3122.1681 3128.4989 3132.1391 3161.0941 3161.2522 3170.4580 3189.1135 3409.1967 3542.6429 3571.8964
redmass: 7.0473 4.6053 3.6311 3.4905 4.4676 6.5361 3.3796 1.1481 3.9763 4.8480 5.6460 5.2523 4.7057 6.6269 4.1983 4.3564 1.9800 3.8313 3.1483 4.6941 1.6223 3.5448 2.2099 4.3232 2.9124 4.0493 6.4844 3.0900 3.5735 3.1993 3.4766 4.8671 2.5206 4.3402 1.7829 4.7964 3.2049 1.3684 4.0956 6.4659 6.0717 5.4481 4.8988 5.2781 3.6079 3.4131 2.0237 5.1934 2.9724 2.1526 1.4333 2.6713 2.4990 1.4973 2.9241 1.4016 4.0236 1.7008 1.5821 1.5392 2.5347 1.3560 2.1718 2.4810 2.3159 1.3356 1.3051 4.5267 3.9377 1.5852 2.4098 1.5614 2.1642 2.8085 2.5033 1.5731 1.6894 1.3763 2.0226 1.4194 1.9055 1.7037 1.1143 1.5506 1.4940 1.8900 1.6099 1.2527 1.5690 3.1161 1.4999 1.8521 2.0948 1.8915 1.3165 1.3029 1.4640 1.3150 1.5007 2.0137 1.4233 1.4464 4.1254 4.8430 1.3187 4.4971 3.6985 1.1414 1.9639 1.0870 1.1189 1.0832 1.0911 1.0535 2.3521 1.5693 4.1873 3.0198 4.8133 4.0887 5.0077 6.6213 6.4135 1.0625 1.0623 1.0648 1.0813 1.0375 1.0821 1.0623 1.0962 1.1000 1.1023 1.0975 1.1033 1.0986 1.0900 1.0890 1.0909 1.0912 1.0925 1.0942 1.0949 1.0954 1.0735 1.0756 1.0663
irintensity: 0.0853 0.2147 0.4982 0.1409 0.0493 0.0689 1.4053 0.0729 0.9195 0.3161 1.5951 3.0545 3.5828 0.2947 6.2514 1.8039 3.8925 1.6035 3.2489 2.3751 92.2177 11.2370 32.5597 28.2996 2.2553 2.9275 18.2743 0.2073 0.7579 1.1445 4.9254 1.3339 46.7914 0.3047 1.4337 4.6009 3.4333 31.8768 11.4249 3.6232 6.3742 34.3598 16.3112 0.5970 45.3293 1.6715 72.6107 3.8524 1.0514 19.6742 45.5192 4.5212 20.4694 18.2263 3.8039 77.9762 0.6362 5.3438 4.3254 38.5944 8.1983 0.8273 7.5663 2.3096 17.6901 0.6489 3.6259 29.4758 3.2041 8.3673 8.2077 10.0336 0.3322 74.9254 35.7285 21.2473 5.9655 11.8325 10.7862 12.6133 47.4838 7.6276 4.2941 13.2581 15.4218 6.4128 5.3226 6.9456 8.0304 2.7112 24.3679 17.8887 9.3835 1.1033 13.5793 3.4251 1.5615 6.0333 4.9924 6.9486 1.4793 1.8946 114.9064 2.1524 1.8521 70.5309 101.5747 44.4055 24.7846 2.5621 11.6744 12.0432 9.7695 6.2578 245.2072 20.8927 305.3542 566.2053 36.7212 238.9827 139.6109 30.2109 0.3203 27.8863 49.1601 48.0882 13.0301 51.6046 27.1127 21.8079 64.5342 66.7513 21.9375 19.0505 85.0686 16.4055 15.9446 17.2006 22.1611 2.9842 1.1356 13.7765 4.7664 25.6670 2.3340 25.6258 13.0501
temp: 298.150 k
press: 1.00000 atm
elementType: 17 8 7 7 7 6 6 6 6 6 6 6 6 6 6 6 6 6 6 6 6 6 6 6 6 6 6 1 1 1 1 1 1 1 1 1 1 1 1 1 1 1 1 1 1 1 1 1 1 1 1
symmnumber: 1
zpe: 1088903.7 jmol-1
zpe.correction: 0.414742 hartree
zpe.thermalcorrener: 0.439292 hartree
zpe.thermalcorrenthalpy: 0.440236 hartree
zpe.thermalcorrgfe: 0.359016 hartree
zpe.sumelectzpe: -1550.345723 hartree
zpe.sumelectthermal: -1550.321173 hartree
zpe.sumelectthermalent: -1550.320229 hartree
zpe.sumelectthermalfe: -1550.401449 hartree
dipole: 4.4383 -1.1343 1.1766
dipole: 4.7297
quadrupole: -191.2135 -147.2533 -164.6911
quadrupole: 4.8737 -4.6370 -6.7755
quadrupole: -23.4942 20.4660 3.0282 4.8737 -4.6370 -6.7755
hfenergy: -1550.7604648 hartree
pointgroup: C01 [X(C22H24Cl1N3O1)]
dipole: -1.7382325 0.4368356 0.5002907 debye
polarizability: 448.8939109|52.8892554|312.5464243|-21.4338868|25.9008746|160.1201291 unknown
InChI: InChI=1S/C22H24ClN3O/c1-14-5-10-19-17(12-14)18(22(27)20-4-2-3-11-24-20)13-21(26-19)25-16-8-6-15(23)7-9-16/h5-10,12-13,20,22,24-25,27H,2-4,11H2,1H3
charge 0 multiplicity 1
51 atoms
Cl 8.130484 0.547654 -0.803495
O  -2.458488 1.865647 2.056707
N  -4.88193 1.332879 0.615373
N  1.284364 -0.982211 0.025004
N  2.233409 1.167557 0.457484
C  -3.533799 1.034142 0.059592
C  -2.956857 2.187617 -0.807539
C  -3.969132 2.581668 -1.912317
C  -2.620365 0.637214 1.247149
C  -5.351815 2.925483 -1.307346
C  -5.854873 1.751045 -0.426469
C  -1.277044 0.053778 0.822406
C  -1.160577 -1.328619 0.402437
C  -0.136269 0.847051 0.829523
C  0.154628 -1.790368 0.013032
C  -2.259332 -2.245952 0.358892
C  1.135603 0.297277 0.422533
C  -2.094458 -3.576871 -0.052278
C  0.309717 -3.148938 -0.405755
C  -0.784085 -4.015381 -0.437886
C  -3.261555 -4.546365 -0.094255
C  3.59654 0.956818 0.143536
C  4.474936 2.069226 0.291764
C  4.125611 -0.286928 -0.30198
C  5.848781 1.951188 0.006427
C  5.502666 -0.404715 -0.587493
C  6.347924 0.709005 -0.431525
H  -3.637196 0.138597 -0.587861
H  -1.997322 1.877592 -1.264207
H  -2.750599 3.057001 -0.153631
H  -4.083781 1.736074 -2.62285
H  -3.57757 3.436401 -2.496052
H  -3.185355 -0.109681 1.8423
H  -5.26798 3.840464 -0.685446
H  -6.085543 3.139364 -2.109602
H  -6.806875 2.010229 0.072633
H  -6.055061 0.873629 -1.075118
H  -4.789235 2.04724 1.354779
H  -0.220674 1.894115 1.141508
H  -2.089644 1.616834 2.94104
H  -3.259572 -1.907726 0.65328
H  1.31168 -3.478666 -0.697186
H  -0.645733 -5.054372 -0.761975
H  2.007532 2.115314 0.764703
H  -3.090669 -5.409592 0.576846
H  -4.203936 -4.062304 0.213809
H  -3.408543 -4.954057 -1.112437
H  4.084046 3.036582 0.633155
H  3.447496 -1.133639 -0.414977
H  6.516008 2.809734 0.123125
H  5.908243 -1.361732 -0.929157
