program: Gaussian 09
title: 000291979
version: EM64L-G09RevD.01
frameworkgroup: C1[X(C21H22ClN3O)]
method: RPBEPBE
basis: SDD
operation: Freq
keyword: #p
keyword: freq=noraman
keyword: PBEPBE/SDD
title: #p freq=noraman PBEPBE/SDD
converged: NO YES NO NO
title: Mulliken charges:
elementType: Cl O N N N C C C C C C C C C C C C C C C C C C C C C H H H H H H H H H H H H H H H H H H H H H H
charge: -0.071703 -0.471105 -0.256954 -0.087088 -0.480380 -0.112933 -0.407225 -0.412923 -0.296770 -0.368191 -0.470398 0.417199 0.212215 -0.588957 -0.033493 0.180601 -0.397125 -0.336025 -0.283358 -0.226678 0.445243 -0.454159 -0.312935 -0.188342 -0.210044 -0.118895 0.240725 0.212054 0.218713 0.193560 0.213387 0.238666 0.195231 0.195161 0.220216 0.202853 0.265914 0.266797 0.348945 0.245940 0.255867 0.229882 0.307795 0.231196 0.222461 0.322199 0.252546 0.250316
chargesum: 0.00000
title: Mulliken charges with hydrogens summed into heavy atoms:
elementType: Cl O N N N C C C C C C C C C C C C C C C C C C C C C
charge: -0.071703 -0.122160 0.008960 -0.087088 -0.172585 0.127791 0.023542 -0.005977 -0.058104 0.022201 -0.047329 0.417199 0.212215 -0.322160 -0.033493 0.180601 -0.151185 -0.080159 -0.053476 0.004518 0.445243 -0.231698 0.009264 0.064204 0.040272 -0.118895
polarizability: 4.27432268e+02 4.71811550e+01 2.92810000e+02 1.52319159e+01 -3.09057441e+01 1.52939523e+02
1716.lowfreq: -8.5405 -4.5795 -0.0015 -0.0013 0.0008 4.9870 22.1575 31.8267 41.6443
frequency: 21.7865 31.6578 41.6324 46.4315 54.5384 65.4574 94.4665 116.7787 139.6378 146.0071 170.2413 190.4098 209.9671 217.8694 233.3812 265.8685 277.5271 296.5238 307.2438 314.7220 331.0724 333.8466 358.4261 402.4780 413.7389 419.4040 437.7492 449.1505 477.9552 501.1223 518.4291 527.1058 543.0660 545.8138 585.3914 604.5829 618.5269 626.6693 662.9152 680.5084 686.0619 703.1018 729.2717 741.1998 767.8900 774.6593 791.4659 799.2441 809.5526 820.3168 832.5934 842.6698 845.1283 876.3812 886.9136 890.4255 902.6868 932.0968 932.6770 941.3772 956.0179 959.6604 986.0471 991.1101 992.4524 994.1766 1029.6973 1036.5570 1052.5538 1060.6873 1071.3722 1073.9737 1105.0746 1108.8458 1115.2047 1131.7112 1155.8226 1172.4844 1180.9699 1187.2098 1196.3672 1214.4233 1242.4508 1252.1946 1257.3283 1263.6670 1268.2685 1288.5932 1298.6248 1301.6017 1304.9678 1326.2061 1333.1634 1340.4426 1341.6911 1352.3056 1359.3901 1374.4349 1384.8822 1403.4435 1409.6426 1418.2500 1440.1303 1455.1358 1458.9510 1464.5584 1465.9104 1472.0187 1480.2700 1502.4877 1529.1646 1559.5540 1597.6859 1601.3729 1613.7949 1619.0306 2963.7160 2967.4368 2969.7372 2973.3970 2980.3323 2983.6536 3027.5589 3032.4885 3046.5405 3052.1128 3114.4889 3128.6745 3130.9885 3138.6044 3156.0909 3161.6575 3169.2931 3171.2673 3188.4868 3409.5036 3541.6441 3572.4865
redmass: 6.9027 4.6464 3.7164 3.7294 4.7494 6.8581 5.2792 3.9744 4.8912 6.6351 5.0797 5.9097 5.0420 4.7157 1.9762 2.9157 5.1148 4.3884 4.4648 1.4744 4.0459 3.0035 2.8119 7.3811 3.0820 3.6470 3.2372 3.0300 5.3920 2.5482 4.0480 1.8824 3.3558 6.5287 1.5740 2.9716 6.1803 6.3692 5.3129 3.1717 4.8005 3.4051 2.4383 3.4846 2.6311 1.9966 3.0053 2.0957 1.4329 2.7502 2.3588 2.7167 1.3934 1.6611 2.2151 2.5857 1.6459 1.8439 1.3596 2.4333 2.3075 1.3994 1.3070 4.4925 1.3913 3.6869 2.2032 2.6639 2.1551 2.8945 2.5025 1.5925 1.6825 1.4153 2.0065 1.5912 1.8643 1.2117 1.1119 1.4500 1.5554 1.4148 1.6805 1.2475 1.6013 2.1322 1.6901 1.9569 2.0332 1.7606 1.3191 1.2990 1.4684 1.3175 1.4576 1.4040 1.8717 1.9485 4.8686 4.2280 3.1945 3.1991 1.1340 1.0902 1.1186 3.0968 1.0893 1.0956 2.3892 4.0920 3.2866 4.9119 3.8685 5.4409 6.6010 6.6159 1.0621 1.0628 1.0647 1.0812 1.0818 1.0627 1.0962 1.1003 1.1022 1.1033 1.0900 1.0852 1.0913 1.0896 1.0949 1.0909 1.1000 1.0948 1.0956 1.0735 1.0756 1.0663
irintensity: 0.1478 0.2336 0.3549 0.0363 0.0376 0.0333 0.9658 0.9758 0.6555 1.9200 5.5777 1.7675 0.7116 8.5274 3.8717 3.7650 3.7727 2.3308 2.5677 119.9007 2.9355 36.2243 1.4970 15.9717 0.3234 2.7465 1.6385 8.1888 3.5229 44.1651 1.1251 3.2899 0.7547 0.7172 34.9763 12.9180 4.4208 3.7074 31.5351 19.4158 23.7952 0.6133 74.0430 21.4815 22.8080 57.0154 2.1359 27.6298 42.9196 4.4322 21.7813 2.9464 55.0005 1.6855 2.8480 6.5028 36.2687 14.9732 1.3981 2.7632 17.8133 0.9119 2.7130 21.9534 2.2270 8.5086 10.3535 5.8357 0.9430 69.5583 36.0662 21.8405 5.4079 11.3347 12.5755 5.1975 47.6156 2.9645 3.7933 8.9773 17.1675 17.7616 2.4885 6.6352 2.3813 13.0967 25.0004 15.5514 10.2316 1.5399 13.7830 3.7543 1.2833 5.1692 5.0112 2.7166 1.8462 5.9925 78.9065 33.2685 139.7489 14.2951 41.9980 1.2341 15.4307 6.1119 6.6823 7.0654 253.9602 309.9790 565.1174 31.5357 183.6203 142.9348 30.5589 27.2634 28.5252 50.9968 48.5666 12.6528 27.6557 23.4302 61.4449 68.0444 18.5274 87.7994 15.7765 1.1746 2.7023 12.0833 26.4806 2.2382 25.7177 4.1522 24.7970 2.2655 25.8282 13.1514
temp: 298.150 k
press: 1.00000 atm
elementType: 17 8 7 7 7 6 6 6 6 6 6 6 6 6 6 6 6 6 6 6 6 6 6 6 6 6 1 1 1 1 1 1 1 1 1 1 1 1 1 1 1 1 1 1 1 1 1 1
symmnumber: 1
zpe: 1018141.7 jmol-1
zpe.correction: 0.387790 hartree
zpe.thermalcorrener: 0.410456 hartree
zpe.thermalcorrenthalpy: 0.411400 hartree
zpe.thermalcorrgfe: 0.334551 hartree
zpe.sumelectzpe: -1511.116134 hartree
zpe.sumelectthermal: -1511.093467 hartree
zpe.sumelectthermalent: -1511.092523 hartree
zpe.sumelectthermalfe: -1511.169373 hartree
dipole: 4.0780 -1.4667 1.3001
dipole: 4.5245
quadrupole: -183.5805 -144.3930 -157.9589
quadrupole: 1.0595 -3.7835 -7.0605
quadrupole: -21.6030 17.5845 4.0185 1.0595 -3.7835 -7.0605
hfenergy: -1511.5039233 hartree
pointgroup: C01[X(C21H22Cl1N3O1)]
dipole: -1.5959546 0.5805384 0.5334974 debye
polarizability: 425.5347117|48.4227295|295.5807329|-24.2953973|24.6071601|152.0663464 unknown
InChI: InChI=1S/C21H22ClN3O/c22-14-8-10-15(11-9-14)24-20-13-17(16-5-1-2-6-18(16)25-20)21(26)19-7-3-4-12-23-19/h1-2,5-6,8-11,13,19,21,23-24,26H,3-4,7,12H2
charge 0 multiplicity 1
48 atoms
Cl 7.942916 0.811985 -0.833672
O  -2.697386 1.541403 2.067469
N  -5.073495 0.899684 0.590008
N  1.20084 -1.101645 0.044532
N  2.033071 1.093128 0.48542
C  -3.705239 0.668393 0.052168
C  -3.172818 1.851749 -0.802511
C  -4.187236 2.199838 -1.921136
C  -2.789147 0.311107 1.250752
C  -5.594771 2.471038 -1.336917
C  -6.051247 1.270889 -0.465599
C  -1.41377 -0.20144 0.837431
C  -1.223917 -1.574604 0.412451
C  -0.315759 0.64851 0.854641
C  0.11581 -1.969768 0.026372
C  0.9840 0.166494 0.446934
C  -2.273181 -2.546814 0.360972
C  0.350691 -3.315962 -0.395782
C  -2.01563 -3.858485 -0.054385
C  -0.694739 -4.243913 -0.436259
C  3.403675 0.960092 0.159071
C  4.22094 2.117019 0.314257
C  3.995238 -0.247265 -0.306871
C  5.596265 2.07821 0.014917
C  5.373689 -0.285541 -0.606861
C  6.158212 0.870871 -0.444065
H  -3.75675 -0.228201 -0.600066
H  -2.193259 1.590839 -1.247295
H  -3.018064 2.727779 -0.14332
H  -4.247803 1.352994 -2.636747
H  -3.830317 3.075895 -2.495415
H  -3.324178 -0.465888 1.834844
H  -5.567617 3.387613 -0.712407
H  -6.325883 2.649042 -2.150208
H  -7.02182 1.481389 0.020456
H  -6.198661 0.385478 -1.11738
H  -5.026028 1.617832 1.330033
H  -0.45397 1.688144 1.172268
H  -2.336839 1.305613 2.958727
H  -3.292303 -2.268113 0.650355
H  1.371519 -3.587098 -0.681911
H  -2.827865 -4.592465 -0.086245
H  1.758386 2.025246 0.800858
H  -0.501802 -5.272482 -0.760754
H  3.781008 3.057078 0.671841
H  3.363496 -1.128633 -0.423622
H  6.216663 2.97049 0.136731
H  5.827774 -1.214326 -0.964981
