program: Gaussian 09
title: 000291960
version: EM64L-G09RevD.01
frameworkgroup: C1[X(C10H24NO3P)]
method: RPBEPBE
basis: SDD
operation: Freq
keyword: #p
keyword: freq=noraman
keyword: PBEPBE/SDD
title: #p freq=noraman PBEPBE/SDD
converged: YES YES NO NO
title: Mulliken charges:
elementType: P O O O N C C C C C C C C C C H H H H H H H H H H H H H H H H H H H H H H H H
charge: 1.245831 -0.499777 -0.532791 -0.635579 -0.083682 -0.478494 -0.009252 -0.708934 -0.705588 -0.618187 -0.618163 -0.224788 -0.240976 -0.664104 -0.657353 0.291543 0.241293 0.223365 0.205737 0.218556 0.267606 0.203826 0.207983 0.216297 0.263031 0.203957 0.219588 0.215235 0.221889 0.218393 0.229488 0.215415 0.218864 0.200504 0.231001 0.229390 0.205555 0.264161 0.219161
chargesum: 0.00000
title: Mulliken charges with hydrogens summed into heavy atoms:
elementType: P O O O N C C C C C C C C C C
charge: 1.245831 -0.499777 -0.532791 -0.635579 -0.083682 -0.186952 0.232041 -0.061276 -0.026174 0.065097 0.038550 0.223093 0.193303 -0.003208 0.031524
polarizability: 1.72711507e+02 -3.44019292e+00 1.66128252e+02 -7.41304356e-01 -2.98409080e+00 1.25040180e+02
1716.lowfreq: -14.3630 -12.0623 -9.3463 -0.0003 0.0014 0.0017 10.6445 18.4588 27.0424
frequency: -5.7549 17.6755 26.7920 58.9539 61.5382 84.5643 92.5172 97.9366 119.9919 136.9423 149.0597 156.6014 173.8294 177.9667 186.9166 202.9536 220.1926 226.5044 239.0635 252.9317 256.8517 264.1784 287.8093 327.5185 338.2700 379.8910 404.0784 416.0722 447.7113 470.9211 508.8081 603.0728 637.1291 715.7081 802.3563 810.0169 818.3396 842.8378 855.2641 878.0151 921.6949 927.5645 956.4822 1011.4907 1015.3483 1028.5930 1061.9972 1067.5343 1094.2174 1095.6508 1099.7584 1103.3925 1123.3702 1129.2137 1137.7865 1145.3167 1169.2835 1180.7564 1219.8707 1245.1146 1264.8647 1303.6269 1314.8888 1323.0864 1344.5962 1346.5413 1356.4551 1377.1386 1384.6964 1389.5921 1398.0687 1433.3943 1451.6223 1455.4941 1456.2227 1457.1719 1461.7517 1467.4437 1467.7395 1473.3000 1478.3759 1479.3178 1489.3473 1490.4741 1492.7458 1493.9807 1506.6793 2892.9876 2903.8140 2974.7904 2978.7917 2980.5745 2983.8806 2990.1007 2990.9308 2992.7835 2995.7055 3012.1700 3026.5951 3040.9602 3061.0288 3062.1956 3065.5826 3068.7890 3073.6754 3080.1220 3083.3634 3086.9134 3091.5835 3105.5506 3107.4011
redmass: 2.2798 3.2860 3.1053 2.7029 2.4656 2.5963 2.5844 3.2916 3.1806 2.7474 3.0314 1.3433 2.8487 1.1646 2.5106 1.2015 2.0402 1.4292 1.8920 1.3682 2.0606 2.7384 3.3781 2.4469 5.2871 3.4917 2.4276 2.7218 4.1064 5.1554 3.3998 7.5017 5.4196 4.4864 1.1141 1.0895 3.0859 2.7949 3.4626 3.4379 1.6077 1.4198 1.4050 4.2863 3.6972 3.6330 1.4771 1.7623 1.9248 1.3966 1.7589 2.0885 2.1058 1.4064 1.4791 1.5451 1.7436 1.6069 1.9127 1.1678 1.1234 1.3978 2.1887 1.8220 1.2563 1.2260 1.5477 1.2097 1.2286 1.2417 1.2071 1.1290 1.1013 1.0460 1.0428 1.0493 1.0578 1.0708 1.0720 1.0538 1.0630 1.0466 1.0549 1.0526 1.0874 1.0485 1.0693 1.0503 1.0520 1.0364 1.0382 1.0537 1.0376 1.0571 1.0407 1.0814 1.0817 1.0795 1.0853 1.1068 1.0987 1.1036 1.0993 1.1007 1.0987 1.0975 1.0990 1.0979 1.0986 1.1017 1.1028
irintensity: 0.0734 0.0833 1.6184 0.5589 0.4311 2.9176 0.2729 1.5518 2.0424 7.0577 1.2727 3.1433 8.1418 2.3813 3.6349 0.2799 5.8562 0.2056 5.9516 2.6720 1.0639 16.7479 3.3944 0.0851 7.1829 1.2117 2.1715 14.7439 11.5803 37.7456 4.5250 135.4518 97.9145 51.7591 4.2486 1.9094 4.0547 2.0499 131.9727 106.7520 4.2157 12.9867 0.9337 122.3657 169.6089 38.5721 31.3560 90.6445 17.9913 0.6935 12.0366 23.0951 3.0845 2.7042 1.3676 9.1545 8.5788 1.2087 7.3392 1.4511 0.0686 0.9453 41.7083 20.4129 3.8377 9.8628 22.0674 8.4350 30.4070 23.3586 22.0773 11.2164 15.1292 13.2431 6.0439 3.1780 6.8155 4.8791 10.0531 7.4571 4.6745 7.4841 6.3224 13.5411 4.5673 30.4985 16.5458 70.2400 189.8296 29.7466 25.1189 30.6798 29.0527 23.4561 47.1264 6.6738 59.9376 29.5575 3.5266 18.1864 14.6046 13.5498 8.0415 32.8447 75.9759 41.6821 33.5334 32.3574 19.3073 37.5107 23.8163
temp: 298.150 k
press: 1.00000 atm
elementType: 15 8 8 8 7 6 6 6 6 6 6 6 6 6 6 1 1 1 1 1 1 1 1 1 1 1 1 1 1 1 1 1 1 1 1 1 1 1 1
symmnumber: 1
zpe: 876211.5 jmol-1
zpe.correction: 0.333731 hartree
zpe.thermalcorrener: 0.354613 hartree
zpe.thermalcorrenthalpy: 0.355557 hartree
zpe.thermalcorrgfe: 0.283398 hartree
zpe.sumelectzpe: -1015.810907 hartree
zpe.sumelectthermal: -1015.790025 hartree
zpe.sumelectthermalent: -1015.789081 hartree
zpe.sumelectthermalfe: -1015.861240 hartree
dipole: -1.9481 1.6247 -3.8490
dipole: 4.6097
quadrupole: -91.1907 -96.6088 -109.3591
quadrupole: -1.2260 -5.3506 -0.2181
quadrupole: 7.8622 2.4440 -10.3062 -1.2260 -5.3506 -0.2181
hfenergy: -1016.1446381 hartree
pointgroup: C01 [X(C10H24N1O3P1)]
dipole: 0.7608174 -0.6339686 -1.5193285 debye
polarizability: 173.2659211|-2.6830116|165.733774|-1.4398362|1.2457829|124.880244 unknown
InChI: InChI=1S/C10H24NO3P/c1-7-13-15(12,14-8-2)10(9(3)4)11(5)6/h9-10H,7-8H2,1-6H3
charge 0 multiplicity 1
39 atoms
P  -0.704279 0.185893 0.404435
O  -1.030684 -1.512165 0.687213
O  -1.759324 0.585308 -0.946538
O  -0.983474 0.980131 1.760348
N  1.838909 -0.806101 -0.216392
C  1.045151 0.373954 -0.47047
C  1.651203 1.750971 -0.052442
C  3.043429 1.911731 -0.710885
C  0.730985 2.93398 -0.435411
C  2.38534 -1.009631 1.128975
C  2.529826 -1.466986 -1.327311
C  -1.075569 -2.46888 -0.449529
C  -3.206393 0.823387 -0.671609
C  -1.662292 -3.766486 0.104284
C  -3.466879 2.269518 -0.237191
H  0.774868 0.407819 -1.543187
H  1.775605 1.75391 1.049143
H  3.49761 2.872464 -0.406883
H  2.961261 1.9137 -1.815031
H  3.736662 1.102938 -0.420003
H  -0.217965 2.914802 0.126725
H  0.497699 2.922435 -1.517123
H  1.235909 3.889921 -0.204786
H  2.584369 -2.085873 1.287385
H  1.648216 -0.693718 1.889509
H  3.334499 -0.455869 1.318602
H  2.683874 -2.538233 -1.091141
H  3.528418 -1.029055 -1.560204
H  1.915855 -1.407735 -2.244475
H  -1.703555 -2.050946 -1.260758
H  -0.046991 -2.61773 -0.829206
H  -3.697735 0.589726 -1.632382
H  -3.560986 0.107941 0.0965
H  -1.709383 -4.534939 -0.690334
H  -1.037736 -4.150447 0.928792
H  -2.681001 -3.597902 0.493193
H  -4.555393 2.442606 -0.13515
H  -2.985275 2.471306 0.734341
H  -3.073171 2.976655 -0.988305
