program: Gaussian 09
title: 000291931
version: EM64L-G09RevD.01
frameworkgroup: C1[X(C11H12N2O)]
method: RPBEPBE
basis: SDD
operation: Freq
keyword: #p
keyword: freq=noraman
keyword: PBEPBE/SDD
title: #p freq=noraman PBEPBE/SDD
converged: NO YES NO NO
title: Mulliken charges:
elementType: O N N C C C C C C C C C C C H H H H H H H H H H H H
charge: -0.205228 0.025743 -0.314871 -0.446889 -0.552511 -0.547431 0.267777 0.251035 -0.529383 -0.388351 0.480966 -0.411007 -0.381766 -0.019591 0.227052 0.227043 0.234361 0.234365 0.231686 0.231687 0.289775 0.240450 0.221450 0.201092 0.281040 0.151508
chargesum: 0.00000
title: Mulliken charges with hydrogens summed into heavy atoms:
elementType: O N N C C C C C C C C C C C
charge: -0.205228 0.025743 -0.033831 0.007205 -0.083786 -0.084057 0.267777 0.251035 -0.239608 -0.147902 0.480966 -0.189557 -0.180675 0.131916
polarizability: 2.60710916e+02 1.14742026e+01 1.46190022e+02 -3.98280309e-03 3.96701729e-03 6.50686673e+01
1716.lowfreq: -127.7527 -3.5689 -0.0006 -0.0004 0.0002 4.5689 8.9898 46.3948 62.0685
frequency: -127.7405 46.3875 62.0665 81.4781 159.0666 190.1257 197.0329 199.4592 290.5671 322.0728 348.7886 394.5391 435.6667 464.3339 540.7014 561.9121 592.9644 639.8194 681.6364 709.2083 743.7137 768.6619 793.1871 812.1677 824.7533 897.1589 908.9863 932.8589 939.2290 946.6297 950.7503 964.4568 987.0402 1031.5099 1041.8365 1105.6552 1142.2887 1145.8431 1167.3665 1199.1882 1201.8975 1218.2734 1238.9426 1255.3762 1282.0434 1293.6849 1308.8159 1341.0082 1385.2133 1390.0880 1436.7930 1454.6533 1462.1631 1485.2939 1488.2289 1506.8704 1567.6254 1593.0473 1621.0841 1663.7994 2908.3666 2952.1483 2982.2555 2990.5680 3022.0580 3024.3703 3034.7370 3080.2376 3112.8813 3139.2879 3148.8293 3345.1020
redmass: 1.5972 4.7721 6.5190 3.8936 2.8349 7.3300 3.3606 3.3322 6.2085 2.9395 4.8132 3.3636 3.0011 4.8855 5.3391 3.0148 6.5686 1.1896 6.0643 2.3046 1.2054 5.8779 4.9788 5.8257 1.3525 1.4549 3.1611 1.4286 1.4357 3.2987 1.5679 1.4961 4.4332 3.4992 1.7757 2.9998 2.2439 1.1968 2.0229 1.4070 1.1961 1.4332 1.0670 1.7526 1.3392 2.3435 1.4935 1.6947 1.5595 2.3447 4.3079 1.1626 1.0885 1.7596 1.2548 2.0622 6.8880 5.7613 7.0260 5.8105 1.0852 1.0864 1.0597 1.0599 1.0622 1.1023 1.1023 1.1047 1.0872 1.0963 1.0928 1.0759
irintensity: 0.4193 4.1412 8.0268 18.0006 14.2869 3.9033 14.1060 6.7433 6.9587 2.2180 0.6335 0.6632 6.4484 1.3959 0.1918 3.4250 3.8994 89.1396 0.2758 5.2397 7.5432 11.2221 4.0991 17.4878 29.2833 2.2565 2.2087 0.7182 23.1481 0.8044 2.8820 23.6880 14.3691 2.2654 4.4562 0.6926 135.9118 0.0001 117.4743 22.4156 0.0104 2.0483 0.0002 21.8715 1.6203 6.7266 11.4712 13.0923 53.5806 2.6338 12.0280 8.3381 12.4454 67.9853 17.6960 102.1028 4.8140 22.5336 9.9088 418.4863 135.1920 73.2646 33.3082 23.4805 73.7448 12.6451 3.0863 49.4988 11.9386 28.5641 0.1805 16.5351
temp: 298.150 k
press: 1.00000 atm
elementType: 8 7 7 6 6 6 6 6 6 6 6 6 6 6 1 1 1 1 1 1 1 1 1 1 1 1
symmnumber: 1
zpe: 545239.1 jmol-1
zpe.correction: 0.207671 hartree
zpe.thermalcorrener: 0.219312 hartree
zpe.thermalcorrenthalpy: 0.220257 hartree
zpe.thermalcorrgfe: 0.168889 hartree
zpe.sumelectzpe: -610.060320 hartree
zpe.sumelectthermal: -610.048678 hartree
zpe.sumelectthermalent: -610.047734 hartree
zpe.sumelectthermalfe: -610.099101 hartree
dipole: 2.1526 4.7268 0.0027
dipole: 5.1939
quadrupole: -71.9738 -79.1012 -84.6962
quadrupole: -22.4824 -0.0110 -0.0020
quadrupole: 6.6166 -0.5108 -6.1058 -22.4824 -0.0110 -0.0020
hfenergy: -610.2679905 hartree
pointgroup: C01 [X(C11H12N2O1)]
dipole: -0.8843345 1.8420099 0.0227459 debye
dipolederiv: -0.4474495 -0.0209526 -0.0009795 0.9365987 -1.102998 -0.0065771 0.0132884 -0.0114936 -0.3352636 0.5575245 -0.2256727 0.0001508 0.5721002 -0.3537127 -0.0006891 0.0121856 -0.0051872 -0.0959191 -1.6226448 0.7122327 0.0034686 0.3290951 -0.2491686 0.0031597 -0.0022188 0.0051493 -0.3278347 0.070864 0.0599973 0.0005066 0.0743152 0.0367552 -0.0014042 0.0006517 -0.0015436 0.1550321 0.0381073 0.0020425 -0.0006277 -0.0967893 -0.0642086 -0.0040487 -0.0022417 -0.0034829 0.1570367 -0.1463737 -0.0755198 -0.0030015 0.0849387 0.0438034 -0.0013937 -0.0005672 -0.002349 0.1638175 -0.3140031 0.1168752 0.0003173 0.4226353 0.2881848 0.0077086 0.0052319 0.0059728 -0.0450527 0.4126397 0.1111417 0.0044361 -0.0975614 -0.1500623 -0.0021668 0.0012124 -0.0009451 -0.048214 0.0325796 -0.1182023 -0.0008503 0.041706 -0.0643287 0.0014414 0.0016472 0.0004935 -0.1397872 -0.1322421 -0.1147383 -0.0017043 -0.2915406 0.0774013 0.0019902 -0.0045642 0.0030378 -0.1531374 -0.2452533 -0.0184124 -0.0018561 -0.1784437 -0.0817674 -0.0026449 -0.0043979 -0.0017108 0.0228929 0.0346194 0.0291896 0.0017769 -0.0724796 0.0351672 0.0031592 0.0002418 0.0037058 -0.1910409 0.653711 0.0908738 0.0057211 0.2974907 0.3815517 0.0090256 0.0090491 0.0078397 -0.1011417 1.4621459 -0.3839435 0.0016854 -1.4365383 1.5722648 0.01381 -0.01382 0.0194718 0.1445046 -0.0190074 -0.0560501 0.0787316 -0.0678625 0.0155286 0.0640586 0.1403091 0.1002956 -0.0610511 -0.016646 -0.0525401 -0.0799376 -0.0628612 0.0205538 -0.0622378 -0.1418156 -0.0983122 -0.0684837 0.0096635 0.0032227 0.044218 -0.0054421 -0.0208308 -0.0854293 0.0173207 -0.1356988 -0.0451279 0.0103478 0.0031573 -0.0435652 -0.0058379 -0.0278667 0.0859019 -0.0169075 0.1362773 -0.0387076 -0.0572292 0.0246898 0.0775087 -0.0185574 0.0137101 -0.0628121 0.148054 -0.0691904 -0.0457847 -0.0546121 0.026255 -0.076829 -0.0147194 0.0095387 0.0643925 -0.1486731 0.0712753 -0.044297 0.0753406 0.0628238 0.0005772 0.0564743 0.0242784 -0.0016165 0.0004809 -0.0015729 0.146966 -0.0203946 0.114172 0.0008301 0.1037409 -0.0379928 -0.0023992 0.0006739 -0.0023521 0.1507802 0.0457618 -0.1125095 -0.0024169 -0.076692 -0.0899546 -0.0043585 -0.0018359 -0.00454 0.1574739 -0.0527755 -0.0804815 -0.0025269 -0.1287389 -0.1740577 -0.0061682 -0.00333 -0.0058629 0.1805864 -0.0485246 0.00007 -0.0021386 -0.1158227 -0.0258213 -0.0062346 -0.0038222 -0.0056337 0.338502 -0.2261493 -0.0977208 -0.0034949 -0.2492082 -0.0759678 -0.0044669 -0.0061528 -0.0036437 0.1232509 unknown
polarizability: 261.1219011|-9.1638655|145.7544705|0.9817149|1.2099344|65.0932332 unknown
InChI: InChI=1S/C11H12N2O/c14-8-13-12-7-9-4-5-10-2-1-3-11(10)6-9/h4-8,13H,1-3H2
charge 0 multiplicity 1
26 atoms
O  4.7566 -1.696334 -0.003359
N  2.537493 0.15388 0.012287
N  3.878352 0.50645 0.025043
C  -3.964586 -1.574292 -0.052271
C  -2.44744 -1.973944 -0.050179
C  -4.033603 -0.006897 -0.028284
C  -1.690278 -0.654963 -0.024948
C  -2.584137 0.450713 -0.01262
C  -0.300401 -0.454421 -0.013645
C  -2.081346 1.769583 0.01121
C  0.216113 0.874568 0.010333
C  -0.684788 1.977342 0.022569
C  1.658628 1.136454 0.022527
C  4.897557 -0.452931 0.015911
H  -4.481368 -2.000086 0.82506
H  -4.471741 -1.972639 -0.947912
H  -2.180396 -2.569183 -0.943811
H  -2.190165 -2.597362 0.826946
H  -4.57963 0.364687 0.860179
H  -4.56913 0.392255 -0.91118
H  0.40625 -1.291163 -0.022758
H  -2.764114 2.627214 0.020911
H  -0.285012 2.99949 0.041022
H  1.968365 2.203802 0.040547
H  4.162744 1.500741 0.04191
H  5.889035 0.061337 0.029814
