program: Gaussian 09
title: 000291939
version: EM64L-G09RevD.01
frameworkgroup: C1[X(C18H16O2)]
method: RPBEPBE
basis: SDD
operation: Freq
keyword: #pfreq=noraman
keyword: PBEPBE/SDD
title: #p freq=noraman PBEPBE/SDD
converged: YES YES NO NO
title: Mulliken charges:
elementType: O O C C C C C C C C C C C C C C C C C C H H H H H H H H H H H H H H H H
charge: -0.188070 -0.202695 -0.212596 -0.569440 -0.616716 0.043962 0.221311 0.052417 0.187334 0.540873 -0.365303 -0.365631 -0.395159 -0.417151 -0.226260 -0.223014 -0.388700 -0.384856 0.437588 -0.807358 0.275208 0.252424 0.255645 0.225112 0.234589 0.284382 0.283751 0.223821 0.225618 0.240348 0.240841 0.226421 0.226782 0.223494 0.223276 0.237754
chargesum: 0.00000
title: Mulliken charges with hydrogens summed into heavy atoms:
elementType: O O C C C C C C C C C C C C C C C C C C
charge: -0.188070 -0.202695 0.062612 -0.061371 -0.157015 0.043962 0.221311 0.052417 0.187334 0.540873 -0.080921 -0.081879 -0.171339 -0.191533 0.014087 0.017826 -0.162279 -0.158074 0.437588 -0.122833
polarizability: 2.47235958e+02 -6.09805425e-01 2.08688653e+02 -3.70302290e+01 -5.57568490e+00 1.28193842e+02
1716.lowfreq: -0.0005 -0.0004 0.0005 2.1661 6.8693 11.1642 20.7785 24.8731 41.6246
frequency: 20.1652 24.8007 41.5710 43.8003 58.2294 87.5707 118.1221 125.9106 177.9991 231.2262 248.5783 272.0887 290.6042 336.1966 372.2362 375.2320 393.9284 405.3233 428.0304 444.8645 466.0566 482.7451 523.7240 546.0327 570.1377 583.0275 639.4216 669.5150 674.9405 718.8175 726.8532 761.1695 768.0187 771.3507 802.0659 811.1212 839.5770 847.9449 884.8007 903.4129 919.4391 951.8699 968.2269 971.3058 987.0750 996.4062 1011.9032 1014.7640 1016.9054 1032.8277 1047.7299 1052.5768 1085.4978 1105.7003 1123.4983 1159.0877 1173.4003 1179.9010 1192.3773 1216.3635 1220.8260 1224.7185 1234.4559 1283.7517 1290.7165 1303.8794 1309.8955 1321.9031 1345.8560 1377.9608 1392.8680 1397.1392 1409.0722 1436.1715 1438.4817 1464.7167 1470.7727 1473.3394 1473.8289 1510.7678 1567.8653 1578.5319 1586.1595 1600.6179 1620.2470 1627.3462 2974.4674 2976.8776 2980.6784 3030.2206 3047.6044 3055.6317 3063.5243 3083.2976 3106.0977 3109.7488 3130.5151 3135.4725 3137.3205 3148.2246 3158.8092 3169.7720
redmass: 4.8052 3.7193 1.2412 3.0872 5.6713 4.7044 4.8162 5.5942 5.2702 4.4890 3.7979 4.1472 2.3064 5.1650 4.2223 2.4944 4.5481 2.8373 3.9420 6.3044 4.9840 3.5462 4.4938 3.7388 4.3987 2.9576 6.6186 4.2136 5.3575 3.2394 3.3108 3.0240 4.3977 2.7505 1.7815 2.0648 2.8767 1.2558 2.3460 2.0347 1.4695 1.3758 2.4205 1.4045 1.5081 1.4039 2.5523 2.0546 1.9238 2.1981 1.5605 3.8073 2.1466 1.8450 1.3768 1.2487 1.1221 1.2213 1.1017 1.8068 4.6978 2.1288 1.8113 1.9316 2.0486 1.3407 1.5579 1.3066 1.6144 4.7758 10.3368 1.2236 2.7945 1.2190 1.9463 2.5750 1.1012 1.0992 1.0541 2.7660 7.8837 7.2671 6.0395 9.6841 8.0933 6.4916 1.0383 1.0645 1.0603 1.0913 1.0958 1.0953 1.0959 1.0997 1.0872 1.0871 1.0960 1.0861 1.0972 1.0897 1.0947 1.1005
irintensity: 0.2329 0.4102 0.4205 0.1612 7.2229 1.0955 0.0629 0.7242 0.5147 2.2556 1.7190 1.7848 1.3331 5.1297 4.8411 0.3264 4.1614 0.2013 3.3202 1.5818 0.1731 8.4721 8.1795 19.4782 1.6324 4.6713 0.0733 1.5912 1.4419 1.1112 20.3753 3.3544 0.1399 13.3152 75.5288 19.5991 9.0182 0.2242 2.5185 19.1088 0.5185 0.2968 42.4869 1.7011 5.2852 3.1620 6.3173 2.3359 4.2855 1.2300 16.2630 1.3108 6.9897 3.5481 15.9038 22.0826 4.3672 5.4530 1.9949 56.4272 14.2389 3.2533 2.3936 19.4611 142.2043 11.4900 49.1283 0.8532 1.8130 0.1513 0.5317 10.4054 1.2798 20.5765 3.8717 0.3757 5.1121 10.9932 13.4146 30.2164 2.1593 222.3691 0.5352 20.5185 69.8270 2.3533 41.5410 11.7759 22.1442 1.4493 28.2348 24.0541 17.7452 19.0956 8.5419 25.1315 47.3574 2.7332 1.4305 3.0170 2.3304 28.0206
temp: 298.150 k
press: 1.00000 atm
elementType: 8 8 6 6 6 6 6 6 6 6 6 6 6 6 6 6 6 6 6 6 1 1 1 1 1 1 1 1 1 1 1 1 1 1 1 1
symmnumber: 1
zpe: 753433.3 jmol-1
zpe.correction: 0.286968 hartree
zpe.thermalcorrener: 0.304263 hartree
zpe.thermalcorrenthalpy: 0.305207 hartree
zpe.thermalcorrgfe: 0.239169 hartree
zpe.sumelectzpe: -844.575238 hartree
zpe.sumelectthermal: -844.557942 hartree
zpe.sumelectthermalent: -844.556998 hartree
zpe.sumelectthermalfe: -844.623036 hartree
dipole: -0.2333 1.6486 -0.4052
dipole: 1.7136
quadrupole: -108.0107 -107.6406 -124.4569
quadrupole: 12.5280 1.6307 -10.1658
quadrupole: 5.3587 5.7288 -11.0875 12.5280 1.6307 -10.1658
hfenergy: -844.8622052 hartree
pointgroup: C01 [X(C18H16O2)]
dipole: -0.0613635 0.6404524 -0.2014535 debye
polarizability: 246.8664609|-4.8969688|207.9954246|-37.3694693|-9.0085654|129.2565682 unknown
InChI: InChI=1S/C18H16O2/c1-12-6-8-13(9-7-12)10-14-11-17(19)15-4-2-3-5-16(15)18(14)20/h2-9,14H,10-11H2,1H3
charge 0 multiplicity 1
36 atoms
O  -0.079373 0.767735 2.048279
O  3.229933 -2.53085 -0.824634
C  0.187073 -1.375756 0.897467
C  1.438068 -2.289459 0.81861
C  -0.605913 -1.407895 -0.461401
C  0.59216 0.05616 1.248259
C  1.811994 0.595581 0.554759
C  2.512695 -1.757996 -0.125904
C  2.708289 -0.27036 -0.143513
C  -1.941625 -0.684052 -0.4162
C  2.057975 1.99111 0.571936
C  3.824475 0.275888 -0.82577
C  -3.064925 -1.278658 0.212954
C  -2.105638 0.597028 -0.998055
C  3.172013 2.524922 -0.106317
C  4.055392 1.665665 -0.810315
C  -4.306986 -0.612076 0.262618
C  -3.349819 1.263346 -0.950309
C  -4.471718 0.674086 -0.314509
C  -5.801282 1.404561 -0.233141
H  -0.489025 -1.729953 1.696484
H  1.168022 -3.313031 0.503994
H  1.896488 -2.36729 1.82683
H  -0.761404 -2.477612 -0.704499
H  0.031075 -0.988861 -1.263594
H  1.357942 2.631728 1.11843
H  4.496722 -0.411678 -1.349609
H  -2.9692 -2.276535 0.660704
H  -1.254389 1.075805 -1.498914
H  3.355845 3.604716 -0.093143
H  4.920407 2.083617 -1.336521
H  -5.162658 -1.09492 0.750826
H  -3.452388 2.252653 -1.41329
H  -5.95218 2.070866 -1.100907
H  -6.649767 0.698792 -0.192025
H  -5.852776 2.033624 0.67692
