program: Gaussian 09
title: 000291944
version: EM64L-G09RevD.01
frameworkgroup: C1[X(C12H11Cl2N5O)]
method: RPBEPBE
basis: SDD
operation: Freq
keyword: #p
keyword: freq=noraman
keyword: PBEPBE/SDD
title: #p freq=noraman PBEPBE/SDD
converged: YES YES NO NO
title: Mulliken charges:
elementType: Cl Cl O N N N N N C C C C C C C C C C C C H H H H H H H H H H H
charge: -0.019517 -0.009639 -0.188490 -0.424620 -0.138436 -0.079805 -0.129246 -0.579396 -0.559234 0.493627 0.125050 0.056530 -0.265027 -0.474356 0.217145 0.015141 -0.065389 -0.176148 -0.146797 -0.755444 0.229232 0.264717 0.336208 0.335955 0.236899 0.258861 0.251674 0.268600 0.238141 0.337820 0.345942
chargesum: 0.00000
title: Mulliken charges with hydrogens summed into heavy atoms:
elementType: Cl Cl O N N N N N C C C C C C C C C C C C
charge: -0.019517 -0.009639 -0.188490 -0.088412 -0.138436 -0.079805 -0.129246 0.104366 -0.065285 0.493627 0.125050 0.056530 0.070928 -0.237457 0.217145 0.015141 -0.065389 0.082713 -0.146797 0.002972
polarizability: 3.15850435e+02 1.69346832e+01 2.14287333e+02 6.26355052e+00 -1.23901774e+01 9.25066798e+01
1716.lowfreq: -8.5667 -5.1658 -0.0011 0.0009 0.0016 1.3094 16.2234 22.6732 35.0792
frequency: 15.5406 22.6447 35.0114 41.2853 66.1316 85.9609 112.0167 128.9839 171.0564 173.1619 184.9128 186.9075 214.8350 225.3238 235.1668 272.7735 331.4716 364.9285 371.8012 414.0750 440.5184 446.1690 459.6068 489.6326 514.0404 525.3316 557.8353 567.7227 575.9813 595.7210 646.9850 662.4110 686.1903 689.0869 700.4064 728.5670 740.7191 787.8027 809.8781 816.2910 865.1458 887.4180 905.3210 927.6580 940.2688 950.1088 998.2973 1001.7636 1020.4347 1044.7137 1088.6842 1114.8275 1142.0487 1152.8644 1205.8758 1223.3335 1240.4729 1267.2486 1283.4326 1314.5257 1367.8631 1369.4609 1398.9918 1401.0748 1430.0529 1441.1149 1447.5301 1449.5893 1467.4593 1489.5774 1529.1892 1541.6228 1585.7491 1606.7165 1623.5498 1645.9659 2982.7207 3027.2096 3067.7309 3125.3348 3127.5836 3134.9503 3173.6399 3181.7648 3523.3841 3550.1340 3708.6008
redmass: 5.4893 8.2872 5.5289 7.0911 6.2874 5.5536 6.0977 1.0885 7.0189 7.3169 14.3662 7.4576 7.4872 6.0089 6.6730 4.7995 5.7497 3.7783 3.0374 4.6293 5.1486 3.3070 4.5296 4.8024 2.8809 1.3186 1.0946 6.2669 4.5572 3.9623 6.1659 1.6866 6.3603 6.2191 3.5439 3.5385 4.8839 4.7706 1.4559 5.7103 2.6145 3.3193 9.5192 1.4054 1.3273 2.3456 5.2456 3.9631 1.9226 2.5529 2.2603 2.1198 1.5833 1.4678 3.1143 2.0095 1.6618 1.6357 2.0970 4.1975 1.3120 5.7509 5.0097 3.6134 1.3611 1.5649 1.2563 1.1152 2.8920 6.2406 3.0160 3.2180 3.3082 5.8779 2.1168 7.9261 1.0379 1.0607 1.0939 1.1012 1.1017 1.0901 1.0951 1.0931 1.0752 1.0445 1.1058
irintensity: 1.9791 0.3759 4.2394 1.3693 2.2163 0.7416 0.6577 0.1746 0.4387 0.5809 0.3066 1.6883 0.2614 6.6658 5.3984 1.6052 0.0207 4.2657 0.9440 7.0497 9.3071 8.1057 7.2267 28.5379 51.9051 213.5233 4.5995 5.0906 15.1887 19.8127 15.8609 48.1860 20.5999 12.4479 0.2822 7.0887 12.6805 8.2369 60.8210 28.9384 7.2261 17.4252 1.1808 26.5554 2.9789 4.7119 31.4630 3.6923 3.4933 6.9289 2.0469 36.5108 15.4777 12.8365 199.8230 19.7669 29.7137 51.5362 8.6364 46.0995 34.4232 125.5441 79.1075 97.1979 16.8936 25.7233 31.4126 42.4728 327.9109 1168.7391 583.1800 447.7689 306.1176 129.6952 231.5698 156.8069 2.6196 5.6813 5.6921 6.9744 5.6611 9.5019 1.8750 47.4753 38.1498 164.6903 53.7337
temp: 298.150 k
press: 1.00000 atm
elementType: 17 17 8 7 7 7 7 7 6 6 6 6 6 6 6 6 6 6 6 6 1 1 1 1 1 1 1 1 1 1 1
symmnumber: 1
zpe: 580594.9 jmol-1
zpe.correction: 0.221137 hartree
zpe.thermalcorrener: 0.240109 hartree
zpe.thermalcorrenthalpy: 0.241053 hartree
zpe.thermalcorrgfe: 0.170479 hartree
zpe.sumelectzpe: -1731.576236 hartree
zpe.sumelectthermal: -1731.557264 hartree
zpe.sumelectthermalent: -1731.556320 hartree
zpe.sumelectthermalfe: -1731.626894 hartree
dipole: -1.1621 -5.6571 -0.3251
dipole: 5.7844
quadrupole: -138.1148 -117.0215 -132.3910
quadrupole: 14.5461 7.3378 -7.5786
quadrupole: -8.9390 12.1543 -3.2152 14.5461 7.3378 -7.5786
hfenergy: -1731.7973729 hartree
pointgroup: C01 [X(C12H11Cl2N5O1)]
dipole: 0.0234737 2.2740327 0.0849887 debye
polarizability: 305.982595|34.3819685|221.0772221|2.6946834|24.3047098|95.5846303 unknown
InChI: InChI=1S/C12H11Cl2N5O/c1-6(20)4-10-17-11(15)19-12(18-10)16-7-2-3-8(13)9(14)5-7/h2-3,5,16H,4,15H2,1H3
charge 0 multiplicity 1
31 atoms
Cl -2.721808 -2.93422 -1.177405
Cl -5.602488 -1.50885 -0.435575
O  4.228633 -2.815679 0.638507
N  -0.439556 1.616304 0.120865
N  1.280008 0.056366 -0.480163
N  3.574013 0.848114 -0.426636
N  1.747117 2.358889 0.175737
N  3.984384 3.060785 0.218521
C  3.121104 -1.475651 -1.075176
C  -1.607775 0.833795 -0.031248
C  2.635334 -0.110611 -0.639358
C  0.896383 1.30915 -0.073861
C  -1.590609 -0.511287 -0.483128
C  -2.852412 1.446034 0.286966
C  3.141374 -2.4911 0.101336
C  3.070832 2.071901 -0.012752
C  -2.801336 -1.215782 -0.602836
C  -4.053311 0.726081 0.157524
C  -4.036366 -0.613134 -0.287466
C  1.80365 -3.065114 0.534391
H  2.441005 -1.855282 -1.858446
H  4.146419 -1.379129 -1.461177
H  -0.568544 2.58432 0.428773
H  -0.636186 -0.975496 -0.735174
H  -2.884203 2.484526 0.636229
H  -5.009329 1.197465 0.40221
H  1.916721 -3.644024 1.463627
H  1.06175 -2.257452 0.664673
H  1.411132 -3.729579 -0.260169
H  3.668759 3.976815 0.52749
H  4.972204 2.852743 0.091318
