program: Gaussian 09
title: 000291996
version: EM64L-G09RevD.01
frameworkgroup: C1[X(C12H10BrN3O4S)]
method: RPBEPBE
basis: SDD
operation: Freq
keyword: #p
keyword: freq=noraman
keyword: PBEPBE/SDD
title: #p freq=noraman PBEPBE/SDD
converged: YES YES NO NO
title: Mulliken charges:
elementType: Br S O O O O N N N C C C C C C C C C C C C H H H H H H H H H H
charge: 0.054968 0.809105 -0.636247 -0.633451 -0.200253 -0.196674 -0.247356 -0.286445 0.023118 -0.163877 -0.337474 -0.216157 0.397893 0.358923 -0.172660 -0.350860 -0.333380 -0.309870 -0.146711 -0.138292 -0.230129 0.322666 0.302282 0.298483 0.404481 0.250137 0.292499 0.274890 0.289297 0.261613 0.259479
chargesum: 0.00000
title: Mulliken charges with hydrogens summed into heavy atoms:
elementType: Br S O O O O N N N C C C C C C C C C C C C
charge: 0.054968 0.809105 -0.636247 -0.228970 -0.200253 -0.196674 0.054926 -0.286445 0.023118 -0.163877 -0.014808 0.082327 0.397893 0.358923 0.077477 -0.058361 -0.058490 -0.020573 0.114903 0.121187 -0.230129
polarizability: 2.80375469e+02 3.02541897e+01 2.22294238e+02 -1.75544021e+01 -2.66689660e+01 1.63182368e+02
1716.lowfreq: -3.9285 0.0009 0.0012 0.0016 1.3084 6.1298 8.8508 15.6146 30.4230
frequency: 8.7091 15.5239 30.4196 41.9204 51.8972 53.7634 92.7332 116.1061 124.1570 144.7725 175.3162 200.9010 208.0487 218.8696 230.7883 256.0110 271.4627 312.9150 341.5316 351.4642 361.0038 390.4908 398.5864 412.1235 424.2734 504.4909 512.1329 515.3537 521.8709 607.5240 618.3096 635.2878 671.6308 685.6901 698.1390 701.3160 711.3028 773.9766 802.0022 818.7841 834.0149 840.5910 844.1843 925.6090 955.8548 973.0747 981.8750 991.9257 992.6532 1004.5705 1050.6970 1052.9988 1053.9388 1082.1197 1098.0724 1109.3450 1116.1231 1161.5291 1168.7868 1204.7685 1214.3379 1269.0225 1290.7879 1364.3833 1372.7246 1399.4076 1400.0520 1418.9949 1441.1041 1446.0754 1462.5549 1524.5487 1558.8927 1583.9290 1584.8583 1594.3673 1594.5710 1655.9330 2737.2472 3145.5200 3148.4217 3162.0548 3163.5345 3172.7088 3178.9846 3181.8096 3187.1925
redmass: 13.1358 6.9624 4.5939 7.5031 10.9388 11.9524 7.6696 9.6564 8.5189 10.0289 5.7288 7.3237 8.1367 10.4811 8.5228 7.6242 9.8689 7.4549 4.9852 9.3162 5.7708 7.7419 7.6506 3.0414 3.6122 2.8929 7.0604 7.1512 6.4034 11.8898 7.7307 7.1792 3.9803 7.2555 7.0232 3.7307 3.7724 17.3300 9.9025 1.4300 1.2714 5.4344 1.3959 1.4414 1.3823 1.3257 6.1191 1.4404 3.5802 1.3610 1.5550 1.9596 1.7656 1.8549 2.6766 1.3447 1.0713 1.4495 1.1265 2.1116 9.6558 1.3106 1.2511 4.0306 8.5826 5.0357 8.7650 3.0202 4.1220 2.3940 2.3657 1.3139 1.5366 4.2503 5.5779 5.1825 6.4483 1.0836 1.0796 1.0886 1.0912 1.0885 1.0936 1.0925 1.0966 1.0971 1.0966
irintensity: 0.2514 1.7755 0.0395 0.5233 1.6244 0.6626 0.9107 0.9995 0.9326 5.5215 5.1987 2.3834 17.7331 7.2253 15.7229 88.1696 1.2341 5.7743 2.2319 6.7156 2.6937 17.8286 17.0341 1.4909 5.2427 51.1763 3.8618 3.7018 34.0262 59.9163 4.8341 6.3491 15.3693 19.9291 5.2946 38.5290 4.0568 33.8981 19.9744 37.4930 7.4251 36.2769 29.8927 19.8135 4.3194 3.5726 3.0300 8.1341 61.0658 3.5620 162.9698 59.1691 66.8267 23.5902 16.7304 6.0588 36.6531 73.8665 20.8091 18.9357 243.1873 0.4812 4.0820 47.9959 80.4354 23.9197 1.1118 51.7681 56.2842 26.0703 61.2747 104.9652 581.1642 2.7025 5.7656 30.2612 4.0854 2759.4654 748.2231 3.7229 0.0920 1.0122 8.9209 9.8718 1.9056 2.2618 2.6321
temp: 298.150 k
press: 1.00000 atm
elementType: 35 16 8 8 8 8 7 7 7 6 6 6 6 6 6 6 6 6 6 6 6 1 1 1 1 1 1 1 1 1 1
symmnumber: 1
zpe: 536575.1 jmol-1
zpe.correction: 0.204371 hartree
zpe.thermalcorrener: 0.224578 hartree
zpe.thermalcorrenthalpy: 0.225522 hartree
zpe.thermalcorrgfe: 0.150079 hartree
zpe.sumelectzpe: -1338.225676 hartree
zpe.sumelectthermal: -1338.205469 hartree
zpe.sumelectthermalent: -1338.204525 hartree
zpe.sumelectthermalfe: -1338.279968 hartree
dipole: 1.3279 -1.5324 2.6643
dipole: 3.3481
quadrupole: -127.5242 -164.6691 -133.6448
quadrupole: 9.9204 -8.3365 -0.8369
quadrupole: 14.4218 -22.7231 8.3012 9.9204 -8.3365 -0.8369
hfenergy: -1338.430047 hartree
pointgroup: C01 [X(C12H10Br1N3O4S1)]
dipole: -0.5025952 0.9765763 -0.7271994 debye
polarizability: 278.5565455|16.8077745|218.8810405|-44.3303273|-8.9881359|168.4144882 unknown
InChI: InChI=1S/C6H5BrN2.C6H5NO4S/c7-5-1-3-6(9-8)4-2-5;8-7(9)5-2-1-3-6(4-5)12(10)11/h1-4,8H;1-4,10H
charge 0 multiplicity 1
31 atoms
Br 5.372299 3.451112 -2.575669
S  -1.442414 0.025666 2.873402
O  -2.32093 1.342122 2.326691
O  0.261452 0.283774 2.408382
O  -0.848362 -5.247279 -0.899408
O  0.640063 -4.464209 0.641868
N  -0.824692 2.802506 0.491259
N  0.265445 2.132223 0.645362
N  -0.47425 -4.396659 -0.004188
C  -1.887719 -1.270594 1.541166
C  -1.003335 -2.330894 1.289784
C  -3.108598 -1.117754 0.85743
C  -1.389307 -3.263322 0.302653
C  1.417441 2.482852 -0.132091
C  -3.463248 -2.072845 -0.125354
C  -2.606303 -3.156832 -0.407029
C  2.584911 1.711434 0.093178
C  1.413918 3.540892 -1.078808
C  3.76193 1.993668 -0.629726
C  2.58502 3.825161 -1.801883
C  3.746891 3.047963 -1.569028
H  -0.042331 -2.429953 1.802885
H  -1.552942 2.371349 1.164357
H  -3.743185 -0.251808 1.077377
H  0.316718 1.063991 1.596801
H  -4.406982 -1.969155 -0.669673
H  -2.854189 -3.909757 -1.159692
H  2.566441 0.90122 0.830632
H  0.497058 4.118889 -1.228185
H  4.669241 1.406828 -0.465241
H  2.602756 4.636209 -2.535053
