program: Gaussian 09
title: 000292010
version: EM64L-G09RevD.01
frameworkgroup: C1[X(C24H20N2O3)]
method: RPBEPBE
basis: SDD
operation: Freq
keyword: #p
keyword: freq=noraman
keyword: PBEPBE/SDD
title: #p freq=noraman PBEPBE/SDD
converged: YES YES NO NO
title: Mulliken charges:
elementType: O O O N N C C C C C C C C C C C C C C C C C C C C C C C C H H H H H H H H H H H H H H H H H H H H
charge: -0.303499 -0.292518 -0.306612 -0.444882 -0.020215 -0.065420 -0.471511 0.528030 0.463372 0.248629 0.224220 0.029736 -0.478481 0.506477 -0.483234 -0.394284 -0.394095 -0.259280 -0.266516 -0.246574 -0.264585 -0.555051 -0.602242 0.301368 0.245462 0.011731 -0.527188 -0.524739 -0.524507 0.322368 0.228503 0.287180 0.230011 0.226796 0.231396 0.229145 0.231481 0.225700 0.223165 0.298101 0.230885 0.225231 0.249523 0.264391 0.214659 0.229283 0.227241 0.232389 0.258955
chargesum: 0.00000
title: Mulliken charges with hydrogens summed into heavy atoms:
elementType: O O O N N C C C C C C C C C C C C C C C C C C C C C C C C
charge: -0.303499 -0.292518 -0.306612 -0.122513 -0.020215 -0.065420 -0.471511 0.528030 0.463372 0.248629 0.224220 0.029736 -0.249979 0.506477 -0.196055 -0.164272 -0.167299 -0.027884 -0.037371 -0.015094 -0.038884 -0.331886 -0.304141 0.301368 0.245462 0.011731 0.178452 0.183594 0.194078
polarizability: 5.28868787e+02 6.04098425e+00 3.64686080e+02 1.39158479e+00 -2.48387766e+00 1.29269333e+02
1716.lowfreq: -5.2222 -4.9482 -2.0564 -0.0009 0.0003 0.0005 13.0221 29.9563 45.1763
frequency: 12.8504 29.9153 45.1615 68.2613 71.9553 81.2330 93.4960 94.4258 98.1389 118.8912 150.9102 155.2305 160.7063 163.6647 170.8241 186.0967 192.8492 213.9056 237.6985 254.1801 261.2466 283.5582 299.9740 321.2357 355.0681 367.6942 374.8437 399.4595 428.3900 435.7156 438.3246 467.0113 474.7069 504.7127 522.5152 546.0360 579.2971 592.5946 613.7130 615.9766 619.1292 633.7951 651.3234 663.7961 669.1822 692.6476 715.4186 728.7907 744.3249 770.7443 772.5735 777.7794 793.4950 830.3437 834.5909 859.7193 872.8657 880.7453 923.3381 933.1743 938.7980 949.3194 959.3189 964.0737 981.5636 990.4779 993.8131 993.8431 1010.4543 1034.9241 1038.6842 1044.1726 1057.3526 1072.0770 1111.6324 1112.0396 1115.5145 1119.0774 1124.0745 1145.9828 1151.9534 1159.3110 1167.4604 1175.7826 1178.9833 1194.2377 1207.7277 1235.1709 1249.2886 1289.7562 1297.4413 1307.3593 1316.7438 1333.1777 1358.9487 1383.5517 1388.0044 1404.5205 1409.1661 1423.0477 1429.3338 1434.9663 1438.2426 1447.7141 1449.7978 1458.4847 1458.9762 1461.9342 1471.0499 1477.1036 1483.8193 1486.2627 1515.9394 1525.4096 1545.2932 1567.3487 1581.5381 1586.5040 1611.6199 1628.2361 1628.6909 2973.9899 2975.7831 2978.9821 3072.1999 3080.4566 3083.6987 3115.2096 3122.0615 3123.3234 3127.8761 3128.1638 3134.9933 3143.1530 3146.5463 3152.6765 3158.2284 3166.9777 3170.5650 3180.2122 3603.4200
redmass: 5.0035 4.8921 5.1778 3.7555 3.2089 2.9086 4.0655 2.9985 3.6997 3.0921 1.4767 3.1637 1.8737 1.3143 1.6136 3.8283 4.3344 3.0317 4.7888 5.8175 5.1881 5.3221 4.1390 4.2868 6.0812 6.1545 6.2820 6.6671 5.3394 5.9095 4.0215 3.1199 6.6811 5.9609 5.8846 3.5774 3.0870 5.3886 4.8400 3.4085 2.7287 2.0433 4.2615 6.1921 6.6590 5.7033 2.5783 4.7128 1.8151 4.1649 4.8339 1.9919 1.9073 7.4556 1.4756 2.2750 3.8790 1.4849 1.6895 7.2743 9.4980 1.4355 8.1849 1.3996 1.4429 7.4703 1.4749 6.0862 3.7034 5.9740 3.1094 1.9235 2.8029 2.1770 1.2427 1.2362 1.2406 1.9527 2.1695 1.5566 1.3855 1.4568 2.7616 1.0851 1.1261 1.9197 1.8185 1.7544 1.6445 2.5297 1.8172 4.8623 2.3236 5.6010 7.0553 4.8172 6.0756 2.3585 1.5841 2.6308 2.0025 1.3806 1.5286 2.4505 1.8854 1.0766 1.1530 1.1092 3.2258 1.0584 1.0545 1.0558 4.7900 4.8954 5.6931 7.4448 7.3222 6.4401 6.5715 6.9774 6.7806 1.0311 1.0337 1.0296 1.1036 1.1055 1.0986 1.0875 1.1028 1.1035 1.0851 1.1046 1.0878 1.0897 1.0909 1.0939 1.0944 1.1001 1.0977 1.0925 1.0806
irintensity: 0.4447 1.2939 0.7786 1.1526 4.0192 3.5586 2.2155 4.8349 2.4496 4.0865 0.9097 1.7724 1.1513 0.7131 1.3323 2.4832 5.2857 8.8819 5.5664 7.8157 0.7209 12.2071 1.6274 4.7292 1.3004 2.3877 8.2244 1.8893 0.2506 2.8288 5.4460 0.3008 11.0209 3.0531 1.1793 2.5930 0.9656 3.8666 5.2891 12.4825 22.6162 31.3111 10.9622 7.9637 0.8722 17.1619 2.9527 18.6520 111.5438 1.4425 5.2607 77.7927 5.7598 6.4599 0.1472 14.3641 13.6160 2.0326 24.3888 44.3966 78.0202 1.0095 30.7108 2.9021 0.0609 6.6967 1.4031 59.0466 0.8464 131.4694 48.3703 12.3518 10.1828 17.1588 17.0582 6.9968 5.4011 4.3656 0.1573 5.3334 1.1980 13.6459 23.3025 0.6426 0.6507 18.2883 31.9288 144.5937 43.4898 4.8434 9.1390 47.2684 3.6650 1.8080 12.7808 2.0596 2.7055 130.4088 67.3928 24.1633 23.6787 10.8649 81.1309 31.5227 105.3382 26.6632 7.9910 5.0668 34.6806 2.5509 23.1390 35.2407 9.1265 0.9903 44.5186 61.8862 0.0422 2.5772 75.1466 1.2652 14.0258 62.3419 114.3765 77.2788 26.5548 17.9750 35.8666 11.9643 23.8166 29.8927 0.5436 14.8880 5.6847 18.8920 7.9914 8.2794 18.5029 37.4185 46.1993 1.8516 25.9322
temp: 298.150 k
press: 1.00000 atm
elementType: 8 8 8 7 7 6 6 6 6 6 6 6 6 6 6 6 6 6 6 6 6 6 6 6 6 6 6 6 6 1 1 1 1 1 1 1 1 1 1 1 1 1 1 1 1 1 1 1 1
symmnumber: 1
zpe: 1002266.4 jmol-1
zpe.correction: 0.381743 hartree
zpe.thermalcorrener: 0.406836 hartree
zpe.thermalcorrenthalpy: 0.407780 hartree
zpe.thermalcorrgfe: 0.325736 hartree
zpe.sumelectzpe: -1259.707448 hartree
zpe.sumelectthermal: -1259.682355 hartree
zpe.sumelectthermalent: -1259.681411 hartree
zpe.sumelectthermalfe: -1259.763455 hartree
dipole: 2.2963 -2.2259 -0.9279
dipole: 3.3300
quadrupole: -128.5961 -152.5438 -172.1076
quadrupole: 4.7676 -3.4235 -0.6498
quadrupole: 22.4864 -1.4613 -21.0251 4.7676 -3.4235 -0.6498
hfenergy: -1260.0891911 hartree
pointgroup: C01 [X(C24H20N2O3)]
dipole: 0.8931007 -0.9006784 -0.3279272 debye
polarizability: 528.935269|4.6462433|363.7060595|-2.9925894|-14.7412355|130.1828722 unknown
InChI: InChI=1S/C24H20N2O3/c1-27-19-12-14(13-20(28-2)23(19)29-3)24-25-21-17-10-6-4-8-15(17)16-9-5-7-11-18(16)22(21)26-24/h4-13,25H,1-3H3
charge 0 multiplicity 1
49 atoms
O  4.627152 2.300795 0.046756
O  4.544068 -2.654447 -0.040773
O  6.076986 -0.193927 0.060803
N  -0.476419 -1.215638 0.067468
N  -0.393738 1.047138 -0.125448
C  -1.805164 -0.782383 0.047422
C  -1.727544 0.623909 -0.073862
C  -3.043655 -1.504919 0.128013
C  -2.924506 1.428973 -0.129689
C  -4.255997 -0.718919 0.074559
C  -4.1969 0.75158 -0.055629
C  0.349042 -0.084309 -0.03831
C  -3.110035 -2.924639 0.254975
C  1.81417 -0.138807 -0.051637
C  -2.861032 2.84565 -0.25396
C  -5.494213 -1.424263 0.153111
C  -5.373151 1.560324 -0.112366
C  -4.345058 -3.580995 0.329595
C  -5.545916 -2.821195 0.277788
C  -4.03601 3.606759 -0.306409
C  -5.299497 2.956256 -0.235102
C  2.523982 -1.366482 -0.101369
C  2.540724 1.080645 -0.033909
C  3.944896 1.064695 -0.031262
C  3.935496 -1.387632 -0.085574
C  4.665085 -0.166879 -0.017278
C  5.493172 2.608713 -1.115355
C  5.623366 -2.92126 -1.018704
C  6.611373 0.279136 1.364494
H  -0.158203 -2.176844 0.168201
H  -2.184562 -3.511973 0.295278
H  -1.874136 3.315098 -0.30646
H  -6.437166 -0.871551 0.116556
H  -6.362151 1.095547 -0.059955
H  -4.387019 -4.670941 0.427197
H  -6.515112 -3.32795 0.335717
H  -3.984958 4.696787 -0.40161
H  -6.221142 3.547206 -0.275747
H  2.021211 -2.338008 -0.154993
H  2.004971 2.033077 -0.020713
H  5.961326 3.576693 -0.880681
H  4.878614 2.700659 -2.030773
H  6.263402 1.828714 -1.252748
H  6.4494 -2.201716 -0.899018
H  5.220936 -2.872888 -2.049027
H  5.960258 -3.945202 -0.796696
H  7.706729 0.233566 1.266489
H  6.272771 -0.392531 2.174429
H  6.281152 1.314377 1.561305
