program: Gaussian 09
title: 000291947
version: EM64L-G09RevD.01
frameworkgroup: C1[X(C17H18ClN3O2)]
method: RPBEPBE
basis: SDD
operation: Freq
keyword: #p
keyword: freq=noraman
keyword: PBEPBE/SDD
title: #p freq=noraman PBEPBE/SDD
converged: YES YES NO NO
title: Mulliken charges:
elementType: Cl O O N N N C C C C C C C C C C C C C C C C C H H H H H H H H H H H H H H H H H H
charge: -0.073337 -0.232715 -0.232545 -0.178434 -0.161865 0.015864 -0.404944 -0.406563 -0.408921 -0.411628 0.454433 0.450463 -0.329855 -0.382562 -0.327284 -0.327680 -0.299412 -0.420315 0.521427 -0.388286 -0.387936 0.390695 -0.799965 0.235184 0.221129 0.238061 0.222183 0.236420 0.232278 0.237414 0.231932 0.262149 0.234659 0.243662 0.243249 0.231293 0.283045 0.283114 0.242780 0.243005 0.219806
chargesum: 0.00000
title: Mulliken charges with hydrogens summed into heavy atoms:
elementType: Cl O O N N N C C C C C C C C C C C C C C C C C
charge: -0.073337 -0.232715 -0.232545 -0.178434 -0.161865 0.015864 0.051370 0.053681 0.059777 0.057718 0.454433 0.450463 -0.067706 -0.147902 -0.083622 -0.084431 -0.299412 -0.189022 0.521427 -0.105241 -0.104821 0.390695 -0.094375
polarizability: 4.48889994e+02 -5.13926126e+00 1.96651842e+02 -3.47479870e+00 -1.04799669e+01 1.31599543e+02
1716.lowfreq: -5.4216 -2.0635 -0.0009 0.0018 0.0019 4.9518 8.2057 31.1493 40.1384
frequency: 8.0867 31.0549 40.1165 68.2463 73.6878 78.8928 106.6771 108.3280 125.2518 136.8844 158.6429 168.5130 191.7913 222.3316 241.0082 264.3502 266.6190 299.2558 321.0817 329.4789 336.3723 412.9312 425.3258 438.2826 441.5140 459.4335 481.0377 499.8608 501.8957 524.4376 565.5264 583.1487 625.6843 625.7881 664.4350 669.7643 693.7356 706.2907 710.2402 731.4327 789.2113 795.7366 807.2679 816.5700 828.0670 831.4348 875.8462 913.9864 932.8069 957.7973 970.5455 979.8910 982.2548 990.3622 992.6708 1018.4371 1037.7437 1044.4496 1069.2262 1073.7724 1081.7274 1101.3758 1123.6134 1162.6272 1182.6700 1189.8030 1198.1315 1214.9474 1235.4761 1240.2719 1250.8478 1263.0484 1283.2083 1285.3712 1310.3794 1341.6741 1347.4531 1352.6733 1361.3029 1368.2788 1374.8644 1385.5069 1387.6072 1399.5847 1402.3172 1420.6531 1455.3319 1461.7270 1472.6330 1474.9034 1478.2543 1490.4903 1490.7585 1510.2581 1512.7441 1552.0848 1572.9645 1623.1598 1632.8254 2923.5357 2930.9818 2953.7902 2954.6396 2980.7223 3021.8308 3026.7650 3039.8444 3043.7146 3058.8170 3088.7937 3127.2187 3159.5513 3160.5634 3161.9430 3176.4966 3181.0710 3184.3878
redmass: 6.1916 6.0748 6.0437 6.6447 5.6838 4.9173 1.1973 3.1153 3.3417 4.3945 4.6735 4.9562 4.9810 6.4482 4.7943 2.1823 2.6863 3.8960 4.7310 5.1101 3.8252 6.0723 3.0707 4.4721 3.1261 5.9183 3.3433 3.5847 3.2199 5.1425 3.8374 4.1477 2.9872 7.0524 4.5924 4.7916 2.7244 4.1597 5.3391 4.7273 5.6664 1.5257 1.5188 2.9493 1.7814 1.6440 1.5363 4.1678 1.3397 3.2163 1.7907 1.4906 1.3470 3.0583 1.4861 2.8734 2.5340 1.4895 2.0459 2.0353 2.0081 2.9475 1.3659 1.3626 2.8454 1.6862 1.6345 1.1862 2.1824 2.8194 1.9210 1.2660 1.3746 1.5767 1.3843 2.9274 2.5291 1.5544 1.7035 1.5915 2.2460 2.0797 2.3188 4.0275 1.2443 3.7177 3.9969 1.0453 1.1355 1.1450 1.1171 1.1460 1.0962 2.9644 3.0292 5.5777 7.6818 6.3121 7.1134 1.0693 1.0704 1.0637 1.0668 1.0368 1.0933 1.0929 1.0962 1.0961 1.0976 1.0994 1.0886 1.0880 1.0943 1.0875 1.0911 1.0956 1.0967
irintensity: 2.1677 1.5694 0.1592 2.2807 0.2124 1.8630 0.5137 0.9314 0.7081 4.1025 5.1523 3.4818 1.7802 0.4946 1.2487 0.9729 1.9842 3.9886 3.5993 1.2251 2.0169 1.4704 1.7231 2.7925 5.0024 0.7491 3.6963 3.1891 4.2222 3.2138 2.3177 3.2812 7.1079 0.5946 24.2648 3.6931 4.7083 21.5592 7.8615 3.9847 3.4844 30.1561 3.0178 12.7803 66.8585 23.9143 7.9858 6.4921 0.2062 140.9207 3.8072 2.9000 0.1123 0.7601 27.1142 54.5319 24.0565 7.4575 7.5030 1.1270 0.6450 13.5738 13.0859 0.4656 30.7388 473.8147 9.3656 296.8557 2.5495 396.4797 13.4077 26.4555 11.9188 48.1426 2.2503 36.3707 47.3674 25.0567 23.1534 26.0748 6.9912 322.9761 1.0581 19.2542 19.3838 0.5678 2.1812 13.5027 26.6699 255.7269 0.6145 28.8945 3.9760 172.6841 168.2944 50.7883 14.4899 643.7931 103.9304 77.8198 24.5765 79.0402 41.3495 41.2472 28.9143 26.1226 21.0416 20.1396 16.9025 17.7614 20.9451 7.1380 18.0425 6.9599 7.1040 1.8990 10.4213
temp: 298.150 k
press: 1.00000 atm
elementType: 17 8 8 7 7 7 6 6 6 6 6 6 6 6 6 6 6 6 6 6 6 6 6 1 1 1 1 1 1 1 1 1 1 1 1 1 1 1 1 1 1
symmnumber: 1
zpe: 844645.7 jmol-1
zpe.correction: 0.321709 hartree
zpe.thermalcorrener: 0.342710 hartree
zpe.thermalcorrenthalpy: 0.343654 hartree
zpe.thermalcorrgfe: 0.269236 hartree
zpe.sumelectzpe: -1431.618478 hartree
zpe.sumelectthermal: -1431.597477 hartree
zpe.sumelectthermalent: -1431.596532 hartree
zpe.sumelectthermalfe: -1431.670951 hartree
dipole: 6.9249 -2.2264 -0.8442
dipole: 7.3229
quadrupole: -234.6792 -133.7819 -142.8028
quadrupole: -6.0000 -1.7762 -2.0268
quadrupole: -64.2579 36.6394 27.6185 -6.0000 -1.7762 -2.0268
hfenergy: -1431.9401866 hartree
pointgroup: C01 [X(C17H18Cl1N3O2)]
dipole: 2.7582149 -0.8024274 -0.2207654 debye
polarizability: 448.9300595|4.541391|193.0538301|-2.0202246|-18.2250889|135.1574896 unknown
InChI: InChI=1S/C17H18ClN3O2/c1-13-2-3-16(12-17(13)18)20-10-8-19(9-11-20)14-4-6-15(7-5-14)21(22)23/h2-7,12H,8-11H2,1H3
charge 0 multiplicity 1
41 atoms
Cl 6.338373 2.452711 0.439559
O  -7.378997 -0.67472 0.899236
O  -7.362463 0.929281 -0.730205
N  1.856016 -0.17739 -0.107369
N  -1.064872 -0.088529 -0.062425
N  -6.757045 0.106108 0.069863
C  1.050157 -1.406874 -0.050778
C  1.125035 1.098938 -0.152033
C  -0.308376 -1.152591 0.631512
C  -0.267139 0.92241 -0.788867
C  3.259023 -0.219808 -0.105713
C  -2.454915 -0.041565 -0.031454
C  4.026399 0.960734 0.132644
C  3.970924 -1.435975 -0.337987
C  -3.204223 -0.869318 0.871881
C  -3.187329 0.835665 -0.901258
C  5.428372 0.890441 0.122167
C  5.378648 -1.455727 -0.325983
C  6.16534 -0.295681 -0.099843
C  -4.602798 -0.822027 0.903106
C  -4.585758 0.884618 -0.86659
C  -5.295092 0.055602 0.035015
C  7.678964 -0.342638 -0.102224
H  1.584295 -2.168886 0.546979
H  0.880608 -1.838657 -1.06192
H  1.685468 1.822483 -0.773858
H  1.014893 1.548551 0.859671
H  -0.88547 -2.094286 0.594552
H  -0.146857 -0.896159 1.700049
H  -0.784073 1.897652 -0.741869
H  -0.155986 0.649376 -1.859666
H  3.546059 1.915979 0.355841
H  3.433192 -2.362642 -0.558279
H  -2.688578 -1.528116 1.575523
H  -2.661298 1.457686 -1.630185
H  5.895801 -2.40429 -0.513365
H  -5.176022 -1.442719 1.597118
H  -5.146807 1.544152 -1.534243
H  8.104667 0.332631 -0.867274
H  8.096159 -0.021698 0.870293
H  8.036413 -1.365723 -0.308519
