program: Gaussian 09
title: 000291963
version: EM64L-G09RevD.01
frameworkgroup: C1[X(C18H18O4)]
method: RPBEPBE
basis: SDD
operation: Freq
keyword: #pfreq=noraman
keyword: PBEPBE/SDD
title: #p freq=noraman PBEPBE/SDD
converged: YES YES NO NO
title: Mulliken charges:
elementType: O O O O C C C C C C C C C C C C C C C C C C H H H H H H H H H H H H H H H H H H
charge: -0.420018 -0.405789 -0.224836 -0.245229 -0.271466 -0.280034 -0.550332 -0.532615 0.537911 0.531210 -0.409197 -0.447310 -0.403686 -0.394680 0.182364 0.196662 -0.225993 -0.220654 -0.249363 -0.249927 -0.245579 -0.244710 0.290282 0.233219 0.242899 0.270377 0.266838 0.247149 0.231165 0.226329 0.218322 0.245682 0.223763 0.224380 0.221215 0.226312 0.225822 0.228059 0.376043 0.375417
chargesum: 0.00000
title: Mulliken charges with hydrogens summed into heavy atoms:
elementType: O O O O C C C C C C C C C C C C C C C C C C
charge: -0.043975 -0.030373 -0.224836 -0.245229 0.018816 -0.046815 -0.037057 -0.018628 0.537911 0.531210 -0.178033 -0.220981 -0.185364 -0.148998 0.182364 0.196662 -0.002229 0.003725 -0.028149 -0.023615 -0.019757 -0.016650
polarizability: 1.96216748e+02 -3.48392375e-03 2.03237879e+02 -1.54576057e+01 1.09441589e+00 1.79451100e+02
1716.lowfreq: -4.6148 -0.0007 -0.0007 -0.0006 2.5905 7.6624 16.5404 23.6399 25.8965
frequency: 16.3941 23.1738 25.8696 32.1662 37.0507 47.8329 57.7925 71.5739 89.2243 137.2741 149.4048 190.8565 204.5580 217.2281 242.0091 245.4147 320.2549 332.4283 402.5687 404.9168 422.8808 445.8507 493.2299 513.3387 523.9188 525.1195 551.4257 570.1157 590.8007 612.0915 618.3654 619.6326 660.2884 663.6316 702.0112 705.6353 711.8767 754.3705 765.2717 772.6495 791.7503 837.5840 848.3506 854.9335 867.2562 913.1656 921.2179 945.5503 956.9679 973.3666 978.1556 987.9189 991.5288 992.7675 994.0826 995.6311 1024.0366 1029.6501 1037.2848 1050.3162 1070.8467 1082.1698 1092.0192 1108.1014 1171.9380 1172.5057 1181.5347 1189.5513 1191.2378 1193.9625 1208.9970 1210.4205 1222.0062 1253.2293 1267.7118 1290.7271 1308.2858 1314.8744 1341.1453 1349.2713 1361.7334 1378.6249 1384.6459 1385.3614 1434.0906 1442.2890 1442.5820 1458.1527 1483.9884 1484.7395 1592.7741 1593.7185 1613.4499 1614.2561 1650.3153 1669.9106 2980.7418 2998.6064 3003.7145 3046.5712 3072.5146 3084.6306 3106.0134 3115.0497 3122.1875 3123.6947 3134.3636 3135.1570 3144.9168 3145.7778 3162.1902 3162.6773 3502.8463 3506.7589
redmass: 8.6058 4.5140 5.6699 5.1265 5.3712 5.5091 6.8421 6.2292 5.9197 5.7500 4.7089 3.8312 4.8432 5.5174 4.3818 4.9927 3.6339 3.6569 2.7900 2.8288 3.4794 3.2216 3.4588 2.5448 2.5667 3.2182 3.2586 3.8842 3.4863 3.3044 5.5931 4.0863 1.5806 1.7038 2.0305 2.0875 2.0926 2.9760 2.8656 2.1255 2.8885 3.2039 1.2590 1.2652 4.3169 1.5783 1.4328 2.7034 2.2873 1.4037 1.3977 3.5877 4.5492 3.5738 1.5414 1.3193 2.7957 2.1919 2.3009 2.6005 2.0912 1.6525 2.0155 2.6458 1.0553 1.0636 1.5948 1.3207 1.1349 1.1659 1.5036 1.6142 1.3341 1.6219 1.6361 1.6057 1.4635 1.4022 1.4719 1.3353 1.5526 1.7029 4.5713 5.2014 1.1002 2.1349 2.1277 1.1040 2.2921 2.2643 5.9883 5.9361 6.1346 6.1274 7.9620 8.5313 1.0808 1.0605 1.0663 1.0854 1.0972 1.0957 1.0870 1.0870 1.0860 1.0858 1.0912 1.0911 1.0959 1.0957 1.1014 1.1014 1.0638 1.0638
irintensity: 2.2371 0.0566 0.6507 0.2451 0.8132 0.6058 0.1203 0.6034 1.6948 2.2539 0.3144 0.6725 0.6948 1.0411 0.1821 0.3447 0.8938 1.8492 0.0550 0.0623 12.7885 4.1114 3.0222 7.8844 54.5139 10.1044 86.3128 16.1829 12.3487 4.6363 2.3942 4.4370 203.2942 42.2070 50.8793 44.6933 32.8790 7.1808 39.1849 18.7335 5.8018 3.5031 0.2549 0.6643 7.8938 0.9608 0.2482 10.9337 19.7863 0.7598 0.4385 8.0899 1.8867 7.1920 1.1360 0.6399 122.2148 38.5359 159.2794 102.4182 65.9798 23.1292 21.5405 171.7462 0.0170 0.1819 3.2446 1.3682 1.6960 1.5112 9.2225 4.6340 3.0011 2.5535 9.9479 14.8429 3.2989 40.2740 23.3157 4.4823 30.4624 30.7924 5.7603 0.6163 25.5959 15.8044 3.7362 7.2222 13.9199 12.9990 0.4494 3.6594 4.6785 4.7205 180.3236 164.3064 13.0465 8.5522 21.6193 4.4694 9.4577 9.2652 12.6146 7.8101 0.8188 0.4215 15.7142 17.4535 16.6368 52.6100 18.4307 26.7448 29.1272 20.4721
temp: 298.150 k
press: 1.00000 atm
elementType: 8 8 8 8 6 6 6 6 6 6 6 6 6 6 6 6 6 6 6 6 6 6 1 1 1 1 1 1 1 1 1 1 1 1 1 1 1 1 1 1
symmnumber: 1
zpe: 832730.0 jmol-1
zpe.correction: 0.317170 hartree
zpe.thermalcorrener: 0.337584 hartree
zpe.thermalcorrenthalpy: 0.338529 hartree
zpe.thermalcorrgfe: 0.263574 hartree
zpe.sumelectzpe: -996.040791 hartree
zpe.sumelectthermal: -996.020376 hartree
zpe.sumelectthermalent: -996.019432 hartree
zpe.sumelectthermalfe: -996.094387 hartree
dipole: -1.2374 0.1400 -2.1515
dipole: 2.4859
quadrupole: -120.5211 -120.0541 -124.9165
quadrupole: 2.0859 -7.5275 2.3367
quadrupole: 1.3095 1.7765 -3.0859 2.0859 -7.5275 2.3367
hfenergy: -996.357961 hartree
pointgroup: C01 [X(C18H18O4)]
dipole: 0.5743706 0.02991 0.7910177 debye
polarizability: 192.9550983|0.2189241|203.1645588|-16.8993323|-0.2117169|182.7860704 unknown
InChI: InChI=1S/C18H18O4/c19-17(20)11-15(13-7-3-1-4-8-13)16(12-18(21)22)14-9-5-2-6-10-14/h1-10,15-16,19,21H,11-12H2
charge 0 multiplicity 1
40 atoms
O  -4.025647 -2.059177 0.802217
O  2.881024 -3.404488 0.160718
O  -3.145869 -1.459978 -1.260338
O  0.82474 -3.139784 -0.872569
C  -0.683994 -0.571875 0.129754
C  0.690915 -0.545036 0.891773
C  -1.655045 -1.632409 0.712606
C  1.303457 -1.941464 1.246828
C  -1.307573 0.830135 0.150995
C  1.723934 0.330896 0.171079
C  -1.433569 1.582749 -1.041657
C  2.35948 1.391636 0.863064
C  -1.769118 1.404381 1.364482
C  2.090229 0.091321 -1.180107
C  -2.968503 -1.68081 -0.043934
C  1.598436 -2.852495 0.071699
C  -1.999346 2.8775 -1.026068
C  3.338293 2.192051 0.231622
C  -2.338907 2.696225 1.385693
C  3.068831 0.887579 -1.814124
C  -2.453895 3.440203 0.188325
C  3.69894 1.940764 -1.111366
H  -0.504879 -0.857857 -0.921021
H  0.496512 -0.076293 1.877829
H  -1.867649 -1.474358 1.78426
H  -1.203815 -2.637158 0.599158
H  2.238533 -1.789604 1.810186
H  0.606048 -2.487111 1.912545
H  -1.094489 1.145929 -1.987795
H  2.076378 1.600176 1.90258
H  -1.695888 0.838925 2.302826
H  1.608795 -0.71436 -1.74673
H  -2.089137 3.443656 -1.960057
H  3.812963 3.010847 0.78416
H  -2.694619 3.121365 2.331393
H  3.33716 0.688715 -2.858054
H  -2.895053 4.443296 0.201892
H  4.456255 2.559807 -1.605303
H  -4.863644 -2.112623 0.266072
H  3.032818 -4.009976 -0.616333
