program: Gaussian 09
title: 000292133
version: EM64L-G09RevD.01
frameworkgroup: C1[X(C17H22N4O9)]
method: RPBEPBE
basis: SDD
operation: Freq
keyword: #p
keyword: freq=noraman
keyword: PBEPBE/SDD
title: #p freq=noraman PBEPBE/SDD
converged: YES YES NO NO
title: Mulliken charges:
elementType: O O O O O O O O O N N N N C C C C C C C C C C C C C C C C C H H H H H H H H H H H H H H H H H H H H H H
charge: -0.237140 -0.272122 -0.274191 -0.253554 -0.238431 -0.251372 -0.335221 -0.243425 -0.279136 -0.184027 -0.092219 -0.409916 -0.609348 -0.116811 -0.125982 -0.040175 -0.084150 -0.408099 0.375373 -0.199183 -0.164741 0.329993 0.330635 0.221508 -0.768318 0.295501 -0.764842 0.245323 -0.749005 -0.786518 0.335350 0.312105 0.222943 0.289217 0.254392 0.319445 0.266747 0.366542 0.272559 0.246579 0.248562 0.251727 0.253275 0.247190 0.252766 0.248359 0.244910 0.237869 0.251746 0.277789 0.334466 0.355058
chargesum: 0.00000
title: Mulliken charges with hydrogens summed into heavy atoms:
elementType: O O O O O O O O O N N N N C C C C C C C C C C C C C C C C C
charge: -0.237140 -0.272122 -0.274191 -0.253554 -0.238431 -0.251372 -0.335221 -0.243425 -0.279136 -0.184027 -0.092219 -0.043374 0.080176 0.218539 0.186123 0.182768 0.205066 0.165738 0.375373 0.067564 -0.164741 0.329993 0.330635 0.221508 -0.000618 0.295501 -0.012651 0.245323 -0.002970 -0.019114
polarizability: 3.01015186e+02 -4.35418261e-01 1.96626880e+02 7.63665632e+00 -4.08334061e+00 2.39162507e+02
1716.lowfreq: -5.7383 -0.0006 -0.0006 0.0002 3.5100 6.4959 19.6464 22.5775 28.9124
frequency: 19.4558 22.5508 28.8685 33.3318 35.3834 38.6348 43.2514 54.5538 58.1247 66.8668 77.5859 78.3487 80.7098 91.1502 96.3447 104.7006 106.1223 109.2038 128.5818 134.6922 144.2691 167.5303 181.0339 185.7747 199.3407 221.7821 248.0184 251.4856 267.2854 290.5607 303.5879 326.3088 331.1035 361.3465 366.7725 387.7091 431.4205 446.2560 477.2800 482.7117 528.9428 535.3655 548.2272 554.3767 559.7965 569.3808 574.8888 578.5776 600.2168 618.1186 625.2493 635.7028 642.0121 646.5973 656.2850 671.0495 711.0360 752.3038 776.2914 780.8871 791.3428 818.5182 827.3492 856.9741 861.6952 882.2619 909.6078 922.1817 928.6843 952.2735 960.9095 991.6012 995.8847 1000.4530 1004.0340 1012.3120 1019.5423 1041.3082 1042.1967 1042.3052 1045.2827 1049.8025 1066.0148 1074.7684 1102.1732 1131.6868 1161.4799 1179.2158 1193.1582 1197.2662 1205.8542 1227.2329 1232.9150 1251.6249 1254.7996 1265.0596 1280.2614 1304.2277 1315.6820 1316.6449 1331.8111 1356.0325 1366.9410 1370.9824 1382.8670 1383.1264 1384.5694 1386.4172 1403.6830 1440.6304 1452.2804 1452.4067 1452.8684 1453.3778 1454.4587 1455.1931 1455.8267 1467.0515 1471.3736 1482.3834 1504.2136 1563.1042 1588.8850 1614.7632 1648.2901 1654.4812 1656.0133 1668.3377 2979.2194 2995.2015 3004.3116 3007.1510 3007.9672 3045.6535 3052.2404 3086.2079 3089.4218 3097.2483 3098.6922 3099.0015 3117.2407 3123.9917 3128.6342 3142.3548 3143.0521 3143.4421 3150.6078 3238.3311 3508.2242 3673.7578
redmass: 5.7862 5.9510 4.6658 5.4713 1.3459 5.5131 7.8355 2.4211 2.0714 1.9476 6.1019 2.2252 4.2237 5.3675 5.8378 1.1195 1.7377 1.6747 5.0263 6.2913 8.7129 8.7949 7.1684 5.4652 6.0484 6.8834 7.2256 5.3364 8.5039 2.9802 5.0933 4.7582 4.2582 3.3344 3.9468 5.0636 4.6285 4.9103 4.1554 4.2411 4.9400 3.9256 1.5077 2.9460 3.1926 3.2102 3.1616 4.7280 4.4626 4.0080 4.4988 4.9545 2.1583 1.4344 4.6004 5.2565 5.5413 4.6178 2.0756 4.4964 3.2026 4.6704 6.3884 1.8210 3.4783 6.2835 4.2972 4.9700 3.1761 4.0128 5.5319 2.0022 2.0128 2.2763 3.6297 1.7269 4.0963 1.7563 1.9720 1.9810 1.7108 2.1282 1.9896 2.1920 3.0419 2.7203 4.0399 3.0650 2.3511 3.2121 3.2578 1.5033 1.2884 2.2621 3.2672 1.3740 1.3512 1.3268 1.5495 2.6690 1.4293 1.5052 1.3739 2.6893 1.2478 1.2454 1.2551 1.2228 1.5895 3.9855 1.0629 1.0625 1.1088 1.0598 1.0499 1.0519 1.0548 1.1692 1.0855 2.9538 3.2595 2.3880 3.7005 2.5281 2.2280 8.6293 9.5518 9.7555 1.0836 1.0377 1.0384 1.0379 1.0371 1.0860 1.0609 1.0975 1.0873 1.0966 1.0944 1.0952 1.0832 1.0841 1.0970 1.1018 1.1013 1.1020 1.1062 1.0991 1.0455 1.1042
irintensity: 0.4048 0.1742 0.8270 0.6975 2.5883 1.2489 0.2616 1.2275 2.2260 3.3165 4.2068 1.8973 2.9662 2.4070 5.2895 0.2437 1.3030 1.3213 7.8188 11.5563 5.0728 2.0086 5.6871 9.1600 9.7192 7.0093 7.1045 1.2353 1.7459 13.2366 2.2244 7.1917 8.8607 0.6253 14.4980 10.2846 3.3741 3.4122 33.9148 1.2500 12.2337 5.9789 73.2570 46.4176 0.2799 3.1024 22.2543 11.9266 12.4609 1.9558 11.7070 4.8936 42.6593 55.6142 54.4624 25.5170 32.5393 10.4718 42.9518 8.5119 4.6223 55.9986 23.8263 42.9286 15.0179 8.6652 58.0490 26.2724 46.6328 36.9807 153.1583 48.5649 69.7236 123.0711 49.5466 16.9317 37.2376 36.0144 16.2858 5.9879 10.7563 108.5837 17.9649 17.4236 20.1953 0.7754 15.3952 183.0959 155.7499 323.9108 279.2185 40.4338 83.1910 73.2729 58.7992 4.4129 54.5504 0.1933 11.3803 116.8205 17.3326 29.7502 20.9381 76.8344 73.7022 57.3222 79.1129 54.5330 83.5852 25.0080 43.9268 15.7900 18.4325 21.8335 15.9262 19.6661 11.3876 9.2846 20.0365 64.8312 88.7856 112.6180 970.7505 178.4429 15.2641 42.3336 301.3207 161.2899 24.3076 3.7309 0.7874 1.5556 2.0700 18.7115 7.4883 12.1666 3.8990 6.8492 4.1184 7.5476 76.9180 254.9219 25.9877 7.9250 10.8568 6.9503 13.9130 0.7898 80.7948 65.6067
temp: 298.150 k
press: 1.00000 atm
elementType: 8 8 8 8 8 8 8 8 8 7 7 7 7 6 6 6 6 6 6 6 6 6 6 6 6 6 6 6 6 6 1 1 1 1 1 1 1 1 1 1 1 1 1 1 1 1 1 1 1 1 1 1
symmnumber: 1
zpe: 1034747.4 jmol-1
zpe.correction: 0.394114 hartree
zpe.thermalcorrener: 0.425948 hartree
zpe.thermalcorrenthalpy: 0.426892 hartree
zpe.thermalcorrgfe: 0.326186 hartree
zpe.sumelectzpe: -1554.816371 hartree
zpe.sumelectthermal: -1554.784538 hartree
zpe.sumelectthermalent: -1554.783594 hartree
zpe.sumelectthermalfe: -1554.884300 hartree
dipole: -0.0778 4.0481 -1.2131
dipole: 4.2267
quadrupole: -155.1707 -169.8536 -174.9973
quadrupole: 5.0200 8.1675 -14.4743
quadrupole: 11.5032 -3.1797 -8.3235 5.0200 8.1675 -14.4743
hfenergy: -1555.2104857 hartree
pointgroup: C01 [X(C17H22N4O9)]
dipole: 0.0843547 -1.2233281 1.1232097 debye
polarizability: 298.8296596|-1.6350197|201.5653373|-13.7805857|14.473191|236.4095761 unknown
InChI: InChI=1S/C17H22N4O9/c1-7(22)20-16-12(15(18)26)19-6-21(16)17-14(29-10(4)25)13(28-9(3)24)11(30-17)5-27-8(2)23/h6,11,13-14,17,20H,5,18H2,1-4H3
charge 0 multiplicity 1
52 atoms
O  0.589152 1.542431 0.849069
O  0.16704 -2.099233 0.955061
O  2.617998 -0.873191 1.414593
O  3.231463 1.385702 -1.826611
O  -0.631703 -2.915077 -1.089255
O  3.046822 -2.939401 0.407295
O  -5.465825 0.090072 -0.434438
O  4.374238 3.061566 -0.669197
O  -0.855605 0.691683 -1.96225
N  -1.579692 0.592152 1.315135
N  -3.463036 1.192121 2.470359
N  -2.770843 -0.098913 -0.866886
N  -6.155418 1.101334 1.563099
C  0.376289 -0.784815 0.339989
C  1.875418 -0.424641 0.203458
C  -0.139124 0.331336 1.265706
C  1.887686 1.11712 0.230966
C  1.962694 1.784435 -1.152141
C  -2.664633 0.420806 0.429729
C  -2.135263 1.079895 2.520935
C  -3.808525 0.770208 1.176457
C  -0.292422 -3.127175 0.091821
C  3.141312 -2.177997 1.393908
C  -5.194715 0.634232 0.702582
C  -0.269181 -4.451149 0.810332
C  4.378112 2.13035 -1.504323
C  3.806108 -2.489811 2.714603
C  -1.965262 0.080661 -1.993805
C  5.558308 1.65071 -2.319385
C  -2.507481 -0.579267 -3.249117
H  -0.084997 -0.744582 -0.655721
H  2.340869 -0.864133 -0.692801
H  0.150582 0.079471 2.306827
H  2.709533 1.474474 0.875941
H  1.937318 2.87985 -1.026906
H  1.15424 1.445539 -1.812924
H  -1.502963 1.340791 3.366169
H  -3.772509 -0.357859 -1.03416
H  0.771418 -4.825378 0.814599
H  -0.593248 -4.338808 1.857169
H  -0.906908 -5.175526 0.283327
H  3.031285 -2.700216 3.474203
H  4.39388 -1.628466 3.070458
H  4.449617 -3.375049 2.606986
H  5.414094 1.926331 -3.379286
H  5.63863 0.551797 -2.27484
H  6.481944 2.116475 -1.946809
H  -3.609288 -0.635225 -3.263188
H  -2.151246 -0.026725 -4.131695
H  -2.107121 -1.609255 -3.299498
H  -7.139277 1.021198 1.314217
H  -5.864667 1.497747 2.458447
