program: Gaussian 09
title: 000291942
version: EM64L-G09RevD.01
frameworkgroup: C1[X(C20H16O)]
method: RPBEPBE
basis: SDD
operation: Freq
keyword: #pfreq=noraman
keyword: PBEPBE/SDD
title: #p freq=noraman PBEPBE/SDD
converged: YES YES NO NO
title: Mulliken charges:
elementType: O C C C C C C C C C C C C C C C C C C C C H H H H H H H H H H H H H H H H
charge: -0.440989 -0.150184 0.163423 0.264623 0.164723 0.128967 0.331559 -0.384628 -0.391494 0.258571 -0.405507 -0.400697 -0.360665 -0.239294 -0.247553 -0.233473 -0.232728 -0.393389 -0.807661 -0.260040 -0.249651 0.268052 0.249022 0.241554 0.241331 0.348046 0.249559 0.229818 0.228388 0.227325 0.227673 0.227269 0.233074 0.205798 0.257083 0.226755 0.225337
chargesum: 0.00000
title: Mulliken charges with hydrogens summed into heavy atoms:
elementType: O C C C C C C C C C C C C C C C C C C C C
charge: -0.092943 -0.150184 0.163423 0.264623 0.164723 0.128967 0.331559 -0.116576 -0.142472 0.258571 -0.163953 -0.159366 -0.111105 -0.009476 -0.019165 -0.006148 -0.005055 -0.166120 -0.111706 -0.033286 -0.024314
polarizability: 2.51992541e+02 -1.18276614e+01 2.45048921e+02 -1.61218843e+01 1.03882500e+00 1.50874222e+02
1716.lowfreq: -6.1809 -3.0892 -0.0008 0.0001 0.0004 4.7148 44.8154 54.7086 56.2521
frequency: 44.7653 54.6961 56.2340 96.3221 127.0312 159.5871 171.6899 178.7329 201.4624 239.0063 254.3768 280.9533 297.4113 303.9989 328.9069 397.5339 409.0552 429.7873 435.2295 451.5735 482.6193 507.0186 526.3467 544.2331 567.1838 585.5332 616.0765 637.1219 638.3590 685.7545 728.1701 735.9547 748.4799 753.9982 764.9033 768.8490 791.6649 793.2511 871.4197 876.8205 883.3164 897.2641 899.1055 950.1807 952.9951 956.0701 973.5462 986.6811 988.2645 988.9652 995.9861 997.6905 1021.0347 1031.7254 1047.4908 1059.5561 1086.7526 1104.0224 1111.8066 1160.5734 1167.4985 1167.6997 1176.5645 1177.5254 1182.8961 1216.3654 1235.9824 1283.2754 1289.5576 1295.1133 1308.7929 1365.4951 1372.4269 1403.6787 1407.4840 1425.7043 1436.5358 1442.7667 1459.3315 1464.2342 1470.2617 1481.9601 1486.8565 1582.1952 1593.3610 1595.2714 1611.1257 1614.5897 1615.4205 2993.7965 3081.6053 3094.3887 3115.8522 3124.3584 3125.7723 3128.8563 3135.7233 3137.2632 3142.3050 3148.5645 3151.4001 3161.2308 3163.8481 3165.5079 3543.1192
redmass: 4.0512 4.1894 4.5954 4.5930 3.5893 2.8971 1.2162 4.1208 3.3248 4.3383 4.1141 4.3549 1.9583 2.5898 2.6615 4.6586 4.3472 3.7593 3.3131 3.0175 3.2344 5.3481 3.7300 5.2958 3.3925 4.6125 7.0085 6.1652 5.9004 5.7497 3.8958 2.7010 2.5891 1.4430 1.7330 1.7340 3.6499 2.6558 1.4183 1.4432 1.4933 3.6309 3.7802 1.4899 1.4894 1.4364 5.3235 1.3373 1.3427 1.3238 5.8839 1.6563 2.2586 1.9845 1.5694 2.2122 2.5653 1.8803 1.9869 1.7687 1.5975 1.2698 1.0954 1.3437 1.8577 2.3068 1.9413 1.4778 1.4895 1.8191 1.9341 7.0929 8.8615 2.0904 1.5815 1.9435 2.2189 2.7854 1.3264 1.7026 1.2474 2.8737 2.6967 6.5074 7.0606 6.6706 6.0675 7.1715 7.1847 1.0375 1.0986 1.0972 1.0863 1.0857 1.0855 1.0878 1.0897 1.0900 1.0936 1.0946 1.0944 1.1008 1.1002 1.0996 1.0659
irintensity: 0.0135 0.0612 0.0590 1.8993 0.3574 0.1834 1.6996 0.0731 2.0888 0.3597 1.2093 7.6966 56.7524 18.0040 33.2563 1.3332 3.0658 3.2872 2.9902 4.9427 0.5719 1.0549 1.0190 3.9374 0.0173 4.8581 3.3960 16.7539 9.2905 0.8789 1.4416 19.5813 64.6384 25.9712 58.8308 76.4199 7.4546 0.8842 1.2341 3.2514 0.2666 31.2000 11.3178 3.9787 2.5498 0.1567 37.0637 0.1611 0.6414 0.2125 3.7625 2.4679 2.5881 6.1920 8.8635 5.8133 4.1256 2.6815 19.7327 7.5817 18.8021 2.1445 0.8893 0.2400 0.6415 3.7242 1.6230 6.4794 6.7687 17.9186 30.4504 5.2354 4.8211 11.5479 15.7028 2.4968 34.1735 10.1462 2.8553 16.1193 18.3472 6.9693 18.4717 0.9289 0.6209 1.4019 4.0640 2.9099 5.1557 36.4216 17.4282 27.9121 11.3184 3.4117 0.3638 5.1602 9.6881 3.3147 35.9765 15.1015 33.9116 28.6683 43.3802 17.7233 11.8191
temp: 298.150 k
press: 1.00000 atm
elementType: 8 6 6 6 6 6 6 6 6 6 6 6 6 6 6 6 6 6 6 6 6 1 1 1 1 1 1 1 1 1 1 1 1 1 1 1 1
symmnumber: 1
zpe: 773856.5 jmol-1
zpe.correction: 0.294746 hartree
zpe.thermalcorrener: 0.311583 hartree
zpe.thermalcorrenthalpy: 0.312527 hartree
zpe.thermalcorrgfe: 0.250762 hartree
zpe.sumelectzpe: -845.525349 hartree
zpe.sumelectthermal: -845.508512 hartree
zpe.sumelectthermalent: -845.507568 hartree
zpe.sumelectthermalfe: -845.569333 hartree
dipole: 1.6232 0.3015 -0.3056
dipole: 1.6790
quadrupole: -109.1223 -111.8549 -121.9965
quadrupole: -2.1918 -1.3757 0.9534
quadrupole: 5.2023 2.4697 -7.6719 -2.1918 -1.3757 0.9534
hfenergy: -845.8200951 hartree
pointgroup: C01 [X(C20H16O1)]
dipole: 0.6417291 0.0627267 -0.1435845 debye
polarizability: 248.522677|-11.9761256|247.1361605|-19.704542|3.7866717|152.2568467 unknown
InChI: InChI=1S/C20H16O/c1-14-8-2-5-11-17(14)20(21)18-12-6-3-9-15(18)16-10-4-7-13-19(16)20/h2-13,21H,1H3
charge 0 multiplicity 1
37 atoms
O  -0.378516 -0.03544 2.225865
C  -0.173201 -0.071039 0.752948
C  0.85126 -1.172795 0.42102
C  0.566732 1.192213 0.245393
C  2.027568 -0.618669 -0.158185
C  1.846667 0.845904 -0.278417
C  -1.552065 -0.250221 0.086029
C  0.752622 -2.548519 0.681142
C  0.131837 2.526848 0.246246
C  -2.777693 0.259161 0.624369
C  3.116483 -1.449321 -0.496559
C  2.704295 1.839484 -0.79359
C  -1.56731 -0.885183 -1.184536
C  1.847016 -3.38549 0.34393
C  0.995215 3.528999 -0.266516
C  3.016061 -2.838995 -0.242255
C  2.269774 3.187154 -0.781071
C  -3.963574 0.078269 -0.139713
C  -2.923611 0.962572 1.967373
C  -2.754379 -1.044407 -1.926869
C  -3.969186 -0.561317 -1.396464
H  -0.155338 -2.963844 1.130764
H  -0.859314 2.795176 0.625021
H  4.025812 -1.035148 -0.946311
H  3.68831 1.58119 -1.200665
H  0.518241 0.024038 2.646345
H  -0.626528 -1.262356 -1.59953
H  1.789048 -4.462587 0.53595
H  0.671187 4.575648 -0.27046
H  3.851626 -3.499832 -0.499334
H  2.922593 3.972992 -1.177396
H  -4.906691 0.458404 0.271976
H  -2.15175 1.730632 2.134538
H  -3.919159 1.436412 2.037445
H  -2.814556 0.248075 2.80094
H  -2.728236 -1.539476 -2.903793
H  -4.906837 -0.676033 -1.951929
