program: Gaussian 09
title: 000291929
version: EM64L-G09RevD.01
frameworkgroup: C1[X(C17H15N3O3)]
method: RPBEPBE
basis: SDD
operation: Freq
keyword: #p
keyword: freq=noraman
keyword: PBEPBE/SDD
title: #p freq=noraman PBEPBE/SDD
converged: YES YES NO NO
title: Mulliken charges:
elementType: O O O N N N C C C C C C C C C C C C C C C C C H H H H H H H H H H H H H H H
charge: -0.222412 -0.198706 -0.208214 0.059417 -0.414084 0.020942 -0.446992 -0.552840 -0.547629 0.268203 0.251775 -0.529777 -0.388209 0.481945 -0.405260 -0.396865 0.305252 0.178307 -0.479409 0.373504 -0.357256 -0.356775 -0.181162 0.227737 0.227571 0.234657 0.234786 0.232868 0.232614 0.290562 0.241940 0.223100 0.206959 0.293450 0.275115 0.286421 0.291448 0.247018
chargesum: 0.00000
title: Mulliken charges with hydrogens summed into heavy atoms:
elementType: O O O N N N C C C C C C C C C C C C C C C C C
charge: -0.222412 -0.198706 -0.208214 0.059417 -0.120634 0.020942 0.008316 -0.083397 -0.082146 0.268203 0.251775 -0.239215 -0.146269 0.481945 -0.182159 -0.189906 0.305252 0.178307 -0.204294 0.373504 -0.070835 -0.065327 0.065855
polarizability: 4.53077113e+02 -2.42587596e+01 2.37101362e+02 -5.56962050e+00 -3.71473180e+00 1.00944248e+02
1716.lowfreq: -130.1822 -5.0037 -2.8509 -0.0010 -0.0007 -0.0002 1.8755 14.5765 26.1586
frequency: -130.1819 14.5347 26.1540 29.5055 51.7251 60.4436 73.9038 102.6281 150.3538 172.5423 180.8201 193.9076 197.5703 209.7575 255.7793 294.8740 330.8591 355.4363 358.6003 384.5119 418.1616 429.2202 436.7307 475.7858 488.5526 529.7753 558.2719 561.4574 608.5830 627.6145 646.3606 656.1648 681.8396 695.5378 697.3140 708.3212 736.0330 741.4420 774.9466 794.4765 809.8647 825.1033 832.7985 896.0609 900.1787 911.5372 928.9299 933.0289 939.2317 959.8078 964.8386 968.2267 988.4353 1013.0681 1023.2634 1032.2994 1041.1858 1084.0037 1089.7955 1105.9769 1130.2313 1144.0987 1160.6760 1173.9541 1198.5185 1200.4254 1211.6922 1216.7297 1239.5156 1246.0764 1254.4431 1281.7891 1288.6790 1292.5423 1309.8297 1344.7554 1372.3128 1389.3145 1395.8916 1429.6862 1437.3433 1454.3956 1460.7661 1469.7112 1485.8597 1489.6393 1516.5880 1566.1238 1576.9939 1591.1519 1613.3409 1620.4892 1621.6799 2957.5568 2983.1096 2989.9640 3022.8857 3025.1898 3034.3410 3080.9491 3115.1988 3141.3990 3149.5968 3153.9609 3160.9286 3171.2649 3188.0347 3383.3099
redmass: 1.5943 4.8464 6.0664 6.6517 5.5467 9.9734 6.9465 5.0224 4.7262 4.2495 4.2308 4.7487 3.7229 6.2937 4.2332 5.1481 11.3360 4.9983 3.9037 6.5406 3.1948 3.0190 5.6791 5.3135 6.4972 5.9346 2.9114 5.5803 5.9937 1.3438 6.2878 5.8352 6.1504 2.4753 8.4569 2.2758 6.3561 1.2199 5.6813 5.3495 6.8542 1.3502 1.4586 1.4618 5.5893 3.2308 1.5826 1.4247 1.4377 3.0097 1.4887 1.3853 6.0044 1.3745 5.8588 3.5771 1.7733 1.7166 1.9395 2.9281 2.7895 1.1991 1.7121 1.1618 1.3778 1.2087 5.9538 1.4748 1.0686 3.2858 1.8307 1.3414 1.3030 2.3429 1.5022 1.8631 10.4541 4.1313 6.9562 3.2713 4.4125 1.1639 1.0856 2.5513 1.2403 1.9785 1.9224 6.7750 6.8802 5.8086 6.8797 8.1220 7.1800 1.0868 1.0598 1.0599 1.0623 1.1022 1.1022 1.1047 1.0874 1.0963 1.0929 1.0881 1.0913 1.0941 1.0973 1.0751
irintensity: 0.4429 0.7706 2.7738 0.3679 1.4304 4.8251 5.4253 6.8283 1.7961 2.7997 2.6722 6.2445 11.3253 0.4330 6.3847 7.1279 0.7137 0.2353 6.3365 4.5052 2.4424 3.3984 7.6096 0.3714 0.4219 1.0544 0.9790 2.7384 3.1829 71.2056 7.5328 4.6735 0.6700 56.6169 43.6710 5.9091 5.4241 8.7774 3.5831 4.2391 10.3205 29.4002 29.4133 2.2698 11.7363 11.3041 13.0025 3.4951 28.0792 10.2240 19.6344 1.8955 2.0619 3.7224 10.8998 7.1089 4.5268 94.9513 21.4205 3.4996 84.9754 0.0001 20.7600 31.3317 14.7264 0.3819 346.7176 5.0713 0.0341 134.3086 87.3773 1.0971 0.8819 10.7242 11.3440 10.2461 113.9744 33.3775 3.3616 8.9877 12.9028 10.8666 13.9994 68.4797 29.0247 34.8143 163.7409 50.8114 38.0166 73.0764 24.7782 135.7182 46.1816 59.9885 32.5124 22.1944 81.0560 12.6545 2.9183 48.1852 11.0648 27.7789 0.5500 6.1944 5.6024 6.9756 3.0086 23.3565
temp: 298.150 k
press: 1.00000 atm
elementType: 8 8 8 7 7 7 6 6 6 6 6 6 6 6 6 6 6 6 6 6 6 6 6 1 1 1 1 1 1 1 1 1 1 1 1 1 1 1
symmnumber: 1
zpe: 757840.7 jmol-1
zpe.correction: 0.288646 hartree
zpe.thermalcorrener: 0.307663 hartree
zpe.thermalcorrenthalpy: 0.308608 hartree
zpe.thermalcorrgfe: 0.237963 hartree
zpe.sumelectzpe: -1045.018668 hartree
zpe.sumelectthermal: -1044.999651 hartree
zpe.sumelectthermalent: -1044.998707 hartree
zpe.sumelectthermalfe: -1045.069352 hartree
dipole: -3.0301 -0.0707 -1.7660
dipole: 3.5079
quadrupole: -117.0920 -138.6325 -134.8927
quadrupole: -24.8098 -6.9880 -1.7466
quadrupole: 13.1138 -8.4268 -4.6870 -24.8098 -6.9880 -1.7466
hfenergy: -1045.3073146 hartree
pointgroup: C01 [X(C17H15N3O3)]
dipole: -1.2460991 -0.5474291 0.2286852 debye
polarizability: 451.1309544|-31.1760018|114.556962|23.7379561|34.7715912|225.4348057 unknown
InChI: InChI=1S/C17H15N3O3/c21-17(15-5-2-6-16(10-15)20(22)23)19-18-11-12-7-8-13-3-1-4-14(13)9-12/h2,5-11,19H,1,3-4H2
charge 0 multiplicity 1
38 atoms
O  1.163554 0.539061 2.274785
O  6.73228 -1.05308 -2.018158
O  4.644975 -0.770352 -2.892942
N  -0.701316 -0.12542 0.281385
N  0.656774 -0.384623 0.174345
N  5.465484 -0.84243 -1.897326
C  -7.283721 1.146897 0.791625
C  -5.826128 1.253804 1.362489
C  -7.195915 0.361767 -0.563912
C  -4.948454 0.542396 0.344248
C  -5.721304 0.040842 -0.739033
C  -3.55754 0.35405 0.380496
C  -5.096239 -0.655845 -1.795741
C  -2.918092 -0.348751 -0.682994
C  -3.698213 -0.848328 -1.764661
C  -1.469803 -0.572441 -0.692174
C  2.993504 -0.279578 0.91262
C  1.535183 0.008216 1.193298
C  3.530345 -0.437933 -0.386475
C  4.912773 -0.678333 -0.527773
C  3.862455 -0.341774 2.034627
C  5.785477 -0.760092 0.577761
C  5.241982 -0.584512 1.867997
H  -7.715392 2.150218 0.63364
H  -7.944107 0.622461 1.503524
H  -5.741963 0.781175 2.359269
H  -5.513572 2.307383 1.490332
H  -7.576877 0.964448 -1.410751
H  -7.805492 -0.562079 -0.541791
H  -2.943294 0.73167 1.204852
H  -5.686079 -1.04488 -2.63362
H  -3.202559 -1.388165 -2.581668
H  -1.059901 -1.132559 -1.559301
H  1.020283 -0.917815 -0.630046
H  2.931937 -0.344385 -1.298046
H  3.427012 -0.183071 3.026441
H  6.849836 -0.94646 0.412799
H  5.896607 -0.634481 2.743472
