program: Gaussian 09
title: 000291936
version: EM64L-G09RevD.01
frameworkgroup: C1[X(C18H20O2)]
method: RPBEPBE
basis: SDD
operation: Freq
keyword: #pfreq=noraman
keyword: PBEPBE/SDD
title: #p freq=noraman PBEPBE/SDD
converged: YES YES NO NO
title: Mulliken charges:
elementType: O O C C C C C C C C C C C C C C C C C C H H H H H H H H H H H H H H H H H H H H
charge: -0.273689 -0.238738 -0.417492 -0.228959 0.522688 0.495040 -0.735183 0.252477 -0.455209 -0.416965 -0.376906 -0.411598 -0.228531 -0.228595 -0.238755 -0.257333 -0.245226 -0.246818 -0.260613 -0.667599 0.247072 0.250482 0.225156 0.226025 0.246959 0.234778 0.231763 0.243765 0.249150 0.225011 0.223542 0.223633 0.223886 0.227854 0.226901 0.238248 0.221158 0.217392 0.225303 0.249929
chargesum: 0.00000
title: Mulliken charges with hydrogens summed into heavy atoms:
elementType: O O C C C C C C C C C C C C C C C C C C
charge: -0.273689 -0.238738 -0.170420 0.021523 0.522688 0.495040 -0.037043 0.252477 -0.220431 -0.185201 -0.133142 -0.162449 -0.003520 -0.005054 -0.015122 -0.033447 -0.017373 -0.019917 0.198793 0.025024
polarizability: 2.17569778e+02 -2.27192420e+01 1.90551087e+02 1.13190796e+01 -8.05436711e+00 1.70067968e+02
1716.lowfreq: -18.1162 -9.9164 -0.0004 0.0005 0.0006 6.4503 14.0146 22.7246 33.4843
frequency: 7.3271 21.4571 33.4473 38.8223 41.9788 60.5351 79.4333 104.7491 132.2760 169.6385 191.5239 216.4158 229.6544 244.3082 252.5782 269.3098 284.9615 315.4557 357.4031 402.2503 404.3237 411.4837 472.1722 491.7491 539.6668 584.6420 613.7736 617.3759 627.1763 667.1947 702.1241 706.4592 710.7665 750.0803 760.9428 778.6700 808.8204 825.4991 850.0885 851.6066 853.3670 862.9347 915.6584 920.3750 942.6240 974.9190 976.3521 990.5082 991.3112 993.0343 994.8432 1010.4697 1027.0647 1029.2411 1044.5820 1065.4600 1078.0119 1081.4983 1093.6080 1105.9229 1123.4066 1155.6625 1171.4406 1172.6131 1188.9395 1190.6024 1194.7854 1204.4758 1245.0892 1274.2528 1275.7892 1308.7732 1321.2325 1337.8011 1346.9292 1355.8278 1379.7791 1383.5980 1384.8690 1386.9967 1438.6144 1440.9617 1455.0619 1462.9045 1473.4921 1478.3172 1481.2410 1484.5051 1484.6841 1590.8368 1592.3676 1608.9136 1613.9211 1637.0428 2987.3797 2991.0813 2994.6163 3029.9909 3038.2257 3085.3641 3086.2329 3091.3308 3098.3162 3114.8714 3116.5299 3117.7865 3120.8069 3122.6942 3133.4366 3136.9288 3143.8588 3147.3033 3161.8927 3162.3007
redmass: 3.2536 3.5371 4.0391 4.0089 3.5861 4.7140 5.5401 4.2600 3.6972 3.5386 2.0631 2.5453 1.4767 2.1509 2.5374 2.4884 4.2339 3.2498 4.4811 2.8025 2.8195 3.4877 3.5854 3.4149 3.3393 5.1362 5.6541 6.2374 5.1379 4.0144 1.7854 1.6280 6.0356 2.3666 1.9328 2.0839 1.6276 2.6245 1.8179 1.7613 1.2857 2.8003 1.5983 1.4621 1.9430 1.4111 1.3924 5.6509 4.6660 1.3601 1.3731 2.6113 2.2336 2.2595 2.1208 2.7740 1.7326 1.7391 2.2159 2.8481 1.7958 1.6796 1.0614 1.0536 1.1151 2.4787 1.1765 2.1109 1.6468 1.4951 1.1545 1.3625 1.4554 1.2906 1.2429 1.3563 5.3185 4.7469 1.3588 1.2357 2.1985 2.1257 1.0935 1.0437 1.0521 1.0986 2.0600 1.1768 1.8207 6.0226 5.9249 6.0560 6.0540 8.7409 1.0350 1.0358 1.0832 1.0591 1.0849 1.0999 1.0978 1.1030 1.1001 1.0868 1.0860 1.1065 1.0861 1.0867 1.0911 1.0918 1.0959 1.0951 1.1014 1.1013
irintensity: 0.6883 0.0513 0.3307 0.2302 0.6201 0.1767 0.9809 0.3973 0.3548 1.5568 2.4847 0.7033 1.5687 1.1590 0.3798 1.5040 0.5478 14.2238 7.0620 0.0328 0.2162 4.6906 2.1092 2.2881 17.3340 20.1940 4.0236 0.9171 7.3074 2.3355 39.0822 74.6238 6.6559 20.0371 42.2180 22.4600 7.8531 1.1440 3.1449 2.4573 0.1689 0.8420 5.0890 1.2706 1.1913 0.0328 0.0868 1.0330 0.9335 0.1585 0.0607 29.5735 5.8219 7.8979 39.6465 22.2113 14.1111 43.8435 97.3253 187.0183 12.2379 14.4659 0.1022 0.0736 0.6477 0.5561 0.0252 1.4007 26.5724 3.5134 7.5781 14.2311 32.6033 2.0605 2.3266 5.0715 2.2178 1.0802 7.9213 31.9711 12.2321 3.1294 11.3031 14.1663 14.3563 20.6391 13.4957 8.0588 18.6878 4.9303 0.4145 14.1113 3.7212 116.5867 21.6212 23.4474 5.7020 25.7711 7.0271 30.0737 31.5862 1.9005 17.8899 7.3458 5.3129 31.3618 1.7707 0.2070 11.3149 21.6807 36.5096 39.0373 35.2825 15.4385
temp: 298.150 k
press: 1.00000 atm
elementType: 8 8 6 6 6 6 6 6 6 6 6 6 6 6 6 6 6 6 6 6 1 1 1 1 1 1 1 1 1 1 1 1 1 1 1 1 1 1 1 1
symmnumber: 1
zpe: 867930.2 jmol-1
zpe.correction: 0.330577 hartree
zpe.thermalcorrener: 0.349977 hartree
zpe.thermalcorrenthalpy: 0.350921 hartree
zpe.thermalcorrgfe: 0.278627 hartree
zpe.sumelectzpe: -846.915381 hartree
zpe.sumelectthermal: -846.895981 hartree
zpe.sumelectthermalent: -846.895037 hartree
zpe.sumelectthermalfe: -846.967331 hartree
dipole: -0.3179 -0.3161 -1.4819
dipole: 1.5483
quadrupole: -105.8498 -113.5440 -116.1837
quadrupole: -2.8182 7.2354 -0.8564
quadrupole: 6.0094 -1.6848 -4.3246 -2.8182 7.2354 -0.8564
hfenergy: -847.2459581 hartree
pointgroup: C01 [X(C18H20O2)]
dipole: 0.1164694 -0.2114633 0.5592465 debye
polarizability: 218.8344291|19.7781309|186.4641535|14.9679086|10.2201621|172.8902507 unknown
InChI: InChI=1S/C18H20O2/c1-3-20-18(19)14(2)17(15-10-6-4-7-11-15)16-12-8-5-9-13-16/h4-14,17H,3H2,1-2H3
charge 0 multiplicity 1
40 atoms
O  2.939303 -1.016352 0.713731
O  2.466992 -0.721766 -1.554585
C  -0.328217 -0.216889 -0.532239
C  0.648692 -1.313781 0.012691
C  -1.785147 -0.566226 -0.189609
C  0.019801 1.207865 -0.070591
C  0.310814 -2.719289 -0.550814
C  2.080954 -0.97415 -0.389543
C  -2.672438 -1.018264 -1.19827
C  -0.372026 2.299409 -0.888366
C  -2.269783 -0.458122 1.139931
C  0.673198 1.489078 1.156515
C  -4.010195 -1.357623 -0.890601
C  -0.123496 3.631907 -0.497026
C  -3.602808 -0.801557 1.452879
C  0.924356 2.823264 1.552982
C  -4.479845 -1.253119 0.438181
C  0.526313 3.900574 0.730825
C  4.387796 -0.750281 0.441596
C  5.108143 -2.040109 0.039376
H  -0.224362 -0.240839 -1.635186
H  0.598392 -1.353909 1.115005
H  1.015385 -3.476073 -0.162052
H  0.375681 -2.71895 -1.653887
H  -0.710754 -3.014601 -0.258589
H  -2.312398 -1.105487 -2.23108
H  -0.877838 2.098834 -1.841114
H  -1.607853 -0.08337 1.929619
H  1.007884 0.673976 1.807231
H  -4.682378 -1.701826 -1.684915
H  -0.432586 4.458486 -1.146938
H  -3.961473 -0.709624 2.484525
H  1.433677 3.01887 2.503773
H  -5.516199 -1.514581 0.679835
H  0.72213 4.933889 1.038662
H  4.457787 0.014778 -0.351233
H  4.761193 -0.34666 1.396364
H  6.19013 -1.842814 -0.077123
H  4.981146 -2.820025 0.81015
H  4.722931 -2.419544 -0.922008
