program: Gaussian 09
title: 000291915
version: EM64L-G09RevD.01
frameworkgroup: C1[X(C10H11FO2)]
method: RPBEPBE
basis: SDD
operation: Freq
keyword: #p
keyword: freq=noraman
keyword: PBEPBE/SDD
title: #p freq=noraman PBEPBE/SDD
converged: YES YES NO NO
title: Mulliken charges:
elementType: F O O C C C C C C C C C C H H H H H H H H H H H
charge: -0.209246 -0.411793 -0.241299 -0.223138 0.513047 -0.491019 -0.725638 -0.393590 -0.361925 0.196698 -0.369342 -0.381247 0.315442 0.247799 0.246884 0.254138 0.216693 0.207688 0.236311 0.257645 0.230474 0.255081 0.252085 0.378252
chargesum: 0.00000
title: Mulliken charges with hydrogens summed into heavy atoms:
elementType: F O O C C C C C C C C C C
charge: -0.209246 -0.033541 -0.241299 0.024661 0.513047 0.010003 -0.064946 -0.135945 -0.131451 0.196698 -0.114261 -0.129161 0.315442
polarizability: 1.25235361e+02 1.33522458e+01 9.97372095e+01 4.58052612e+00 -1.29478981e+01 9.90573078e+01
1716.lowfreq: -9.3972 -0.0007 -0.0007 -0.0002 1.8390 7.4457 24.7033 31.7509 51.5747
frequency: 24.2471 31.7430 51.5564 104.4698 147.4249 190.1470 231.5618 233.7493 273.1664 354.8904 377.2232 411.0669 417.0092 448.2754 514.1803 518.2151 543.2989 596.9222 629.5906 653.5834 690.9370 728.0039 805.6245 816.3931 834.2257 851.5893 903.9614 934.2434 943.3419 958.6600 1005.4286 1024.4570 1047.1488 1076.9614 1110.2282 1121.1472 1155.5270 1180.3122 1197.0831 1214.6315 1252.6349 1288.3542 1295.9819 1328.8458 1359.0125 1388.5952 1395.4365 1413.4121 1435.2781 1475.3171 1480.4271 1495.4140 1602.0724 1611.5961 1662.0888 2979.3866 2987.3554 3010.5216 3066.8813 3073.1362 3087.0207 3132.5515 3144.2748 3171.6800 3175.4812 3506.8955
redmass: 3.8811 7.7179 10.3316 4.1292 3.8601 3.7897 1.5140 1.9645 3.6655 5.1380 5.5592 2.9400 4.3361 3.4937 2.2763 3.3761 2.5347 3.5508 6.7945 1.4931 3.5111 3.5104 5.7679 1.2573 1.6003 3.1079 1.9368 1.9870 1.4237 1.3696 2.9337 1.7366 2.0600 2.1460 1.8500 1.7461 1.5041 1.3393 1.7681 2.2913 1.4618 1.3558 1.4414 1.9669 1.7461 4.3282 1.2511 2.3316 1.1007 1.0596 1.0884 2.4029 7.4600 6.4627 8.3788 1.0364 1.0644 1.0846 1.0979 1.0964 1.0997 1.0891 1.0900 1.0953 1.0963 1.0638
irintensity: 0.3108 1.0763 1.5386 0.0645 2.5826 0.4346 0.5890 0.6999 1.2222 4.4863 0.9053 0.0683 3.1022 3.7204 8.8171 33.4153 54.8569 16.3554 0.4659 92.6085 49.7606 5.5358 12.8094 0.8399 62.9359 3.7936 26.3557 8.1889 0.8540 0.7711 15.0693 41.8572 135.0364 65.4944 11.9062 45.9129 36.0803 0.3644 29.3877 19.4974 2.9533 6.4031 20.7504 7.0493 50.6541 1.1242 7.5989 4.0143 21.4427 16.4929 0.4041 109.0414 3.7074 15.8133 178.7356 27.4851 18.2009 3.7046 8.2804 45.9623 29.4764 12.7310 5.8620 5.3042 2.1187 21.6789
temp: 298.150 k
press: 1.00000 atm
elementType: 9 8 8 6 6 6 6 6 6 6 6 6 6 1 1 1 1 1 1 1 1 1 1 1
symmnumber: 1
zpe: 491497.0 jmol-1
zpe.correction: 0.187201 hartree
zpe.thermalcorrener: 0.199706 hartree
zpe.thermalcorrenthalpy: 0.200650 hartree
zpe.thermalcorrgfe: 0.146474 hartree
zpe.sumelectzpe: -637.003177 hartree
zpe.sumelectthermal: -636.990672 hartree
zpe.sumelectthermalent: -636.989728 hartree
zpe.sumelectthermalfe: -637.043905 hartree
dipole: 2.4441 1.4407 -0.8470
dipole: 2.9609
quadrupole: -82.4523 -70.5597 -75.6217
quadrupole: -1.0449 -2.3564 -0.5281
quadrupole: -6.2411 5.6515 0.5895 -1.0449 -2.3564 -0.5281
hfenergy: -637.1903784 hartree
pointgroup: C01 [X(C10H11F1O2)]
dipole: -1.0028374 -0.3353348 -0.4887622 debye
dipolederiv: -1.0396938 -0.3577777 0.0098768 -0.3897891 -0.3106929 0.0044462 0.0155839 0.0052759 -0.210228 -0.554095 0.2516789 -0.101847 0.4205438 -1.0644649 0.3027125 -0.0910403 0.2513991 -0.3229844 -0.4371545 0.1233846 0.0002818 0.1782071 -0.5930124 -0.0871971 -0.1256831 0.1785643 -0.8809342 0.1888191 -0.0218793 -0.030217 0.0209844 0.2106942 0.0129909 -0.0617331 -0.0743826 0.056897 0.2152467 0.0992651 0.0098384 0.1027429 -0.1135441 -0.0249084 0.0203655 -0.0034159 -0.1352859 0.0312276 0.0002017 -0.0721234 0.0339006 -0.2058837 -0.1584136 0.0082159 -0.1778833 -0.0989823 -0.0363327 -0.0079579 -0.0087815 0.0157966 -0.0163332 -0.0718874 0.0152481 -0.0231179 0.0682285 -0.0212651 0.0415853 -0.0042017 0.0290237 -0.1167288 0.0338006 -0.072096 -0.0139353 0.0906807 -0.038858 0.0536424 -0.0284138 0.0527769 -0.1128697 -0.0074991 0.0571572 0.0389172 0.090812 0.4202232 -0.3573898 0.1583391 -0.6355485 1.3613692 -0.0372522 0.1720763 -0.1803249 1.0930997 -0.2016414 -0.0177645 0.0136501 -0.0082688 -0.1510689 0.0118517 0.1692056 0.0630254 -0.0211491 -0.2065299 -0.0085175 0.0020909 -0.021293 -0.1617337 -0.0011742 -0.168942 -0.0721642 -0.0189933 1.0915299 0.4193115 -0.0137829 0.4424195 0.2648083 -0.0070347 -0.0055771 -0.0048608 0.2424193 0.0334665 -0.006092 -0.002747 -0.0272582 0.0459744 0.0126014 0.0287645 0.0688112 -0.0885276 -0.1328049 -0.0502848 -0.0040566 -0.0520019 0.0610273 -0.0250832 0.0052477 -0.0177326 0.0887535 0.1028431 0.0144184 0.0758804 0.0033615 0.0329232 0.0465785 0.0308324 0.0613206 -0.0334691 -0.1596366 -0.1399397 0.0083916 -0.1119861 0.0273445 -0.0108177 0.0207846 -0.0086178 0.078575 0.1036415 -0.0031405 0.0381698 -0.0027238 0.0464804 0.1012726 0.0229387 0.0232001 -0.1322826 -0.0025923 0.1464275 -0.0231338 0.1203516 -0.0445657 0.0026153 -0.0305153 0.0292371 0.0664525 0.0728386 -0.0458638 0.0835938 -0.0461224 0.1249617 0.02069 0.0694254 0.0189608 -0.0062007 0.0548482 -0.0383054 -0.0940544 -0.0322638 0.1215243 -0.0413591 -0.0938465 -0.0419529 -0.0368651 0.0611325 -0.0493006 -0.0598608 -0.0553255 0.1561866 -0.0270897 -0.0721611 -0.0297031 -0.0009438 0.0621912 -0.0481908 0.0587967 -0.0513083 0.1557599 0.025873 0.07202 0.0300005 -0.0096193 0.3925964 0.002489 -0.0156897 0.0137806 0.281844 -0.0757165 0.0137288 -0.1206209 0.1205471 unknown
polarizability: 124.8287166|15.353402|88.8129979|1.6059212|4.7678441|110.388164 unknown
InChI: InChI=1S/C10H11FO2/c1-7(6-10(12)13)8-2-4-9(11)5-3-8/h2-5,7,12H,6H2,1H3
charge 0 multiplicity 1
24 atoms
F  4.028944 0.981519 -0.144348
O  -2.926487 2.016399 0.145425
O  -2.24798 0.667796 1.907072
C  -1.245259 -1.324971 -0.036486
C  0.165239 -0.726205 -0.076013
C  -2.316958 -0.254371 -0.391747
C  -1.400012 -2.557637 -0.960463
C  0.845003 -0.420455 1.131105
C  0.811936 -0.438555 -1.307401
C  -2.465229 0.806555 0.682715
C  2.138083 0.14982 1.122305
C  2.102722 0.132288 -1.34238
C  2.737135 0.41233 -0.120006
H  -1.445132 -1.644691 1.003835
H  -3.306406 -0.744477 -0.499732
H  -2.098984 0.237045 -1.355661
H  -2.396889 -3.018741 -0.831754
H  -1.293404 -2.288422 -2.027686
H  -0.635916 -3.319784 -0.72793
H  0.349994 -0.617205 2.088176
H  0.312274 -0.665226 -2.256253
H  2.667689 0.388962 2.049037
H  2.60976 0.355027 -2.285829
H  -3.040023 2.679098 0.880716
