program: Gaussian 09
title: 000028014
version: EM64L-G09RevD.01
frameworkgroup: C1[X(C11H10O2)]
method: RPBEPBE
basis: SDD
operation: Freq
keyword: #pfreq=noraman
keyword: PBEPBE/SDD
title: #p freq=noraman PBEPBE/SDD
converged: YES YES NO NO
title: Mulliken charges:
elementType: O O C C C C C C C C C C C H H H H H H H H H H
charge: -0.218900 -0.208758 -0.703617 0.471601 0.480023 -0.432358 -0.516184 -0.441336 -0.378550 0.189857 -0.215345 -0.214409 -0.243929 0.227833 0.249324 0.259811 0.239081 0.284920 0.232418 0.242390 0.230603 0.231650 0.233874
chargesum: 0.00000
title: Mulliken charges with hydrogens summed into heavy atoms:
elementType: O O C C C C C C C C C C C
charge: -0.218900 -0.208758 -0.226460 0.471601 0.480023 0.066535 -0.231264 -0.208918 -0.136160 0.189857 0.015258 0.017241 -0.010055
polarizability: 1.65350936e+02 8.49218418e+00 1.05665494e+02 -2.42540190e+01 -5.68259579e+00 8.32640526e+01
1716.lowfreq: -3.3549 -0.0006 0.0004 0.0005 2.3479 10.7243 24.1682 37.7030 65.1747
frequency: 23.1862 37.3673 65.1533 172.4544 199.4414 220.9068 261.9262 321.5553 403.7650 426.0599 461.7265 478.0909 573.5319 616.0720 639.4719 661.2471 680.4972 706.1661 755.4477 798.1117 809.1428 855.5487 864.3747 890.8286 915.5358 936.1277 966.6259 979.4021 986.1049 990.9508 999.6100 1026.3352 1080.4415 1085.7519 1129.8510 1164.6761 1169.2260 1174.5309 1189.1959 1205.2069 1276.8760 1295.9240 1332.9463 1335.6310 1382.0007 1440.2740 1446.4566 1455.2337 1483.7188 1594.0424 1612.6539 1641.1342 1704.8882 2977.4786 3003.1929 3033.8243 3060.8301 3117.8198 3119.0711 3135.7318 3147.5022 3165.8120 3213.1134
redmass: 4.0271 5.1607 5.3675 5.4776 4.7310 3.2256 4.9082 2.1986 2.8118 2.9542 3.0231 6.0038 5.0240 5.8803 3.8282 6.6865 5.1509 1.8170 1.8964 3.5754 5.9328 1.2582 1.7436 2.2195 1.5745 2.0637 5.0039 1.3916 1.9194 5.3035 1.3216 2.2498 2.1338 2.5456 1.0827 1.7113 1.2427 1.0630 1.1163 2.3667 1.7006 1.5039 1.3196 2.0547 7.9889 1.9405 1.1301 1.1254 2.2194 6.1231 6.1123 7.6252 12.1608 1.0608 1.0585 1.0992 1.1043 1.0880 1.0874 1.0904 1.0956 1.1014 1.0988
irintensity: 1.0947 1.8374 0.8735 2.1531 4.3077 4.6448 2.0585 0.1498 0.0824 10.1518 11.5683 1.4812 4.7389 0.7163 7.7155 0.7334 3.2124 50.3462 47.3896 15.3515 58.6079 0.3670 16.9487 14.8382 8.5908 18.0314 25.2816 0.0896 2.8860 1.6223 0.4469 8.2817 30.8383 51.5835 2.8533 3.3943 6.2796 0.6255 0.5078 0.2789 3.4448 0.8428 0.5711 6.0841 0.0615 9.2131 8.7689 19.8258 17.1948 2.9915 14.5637 36.5457 483.4273 17.3569 18.6423 10.6207 10.6086 7.4099 6.0018 6.4625 34.3111 21.3861 1.4337
temp: 298.150 k
press: 1.00000 atm
elementType: 8 8 6 6 6 6 6 6 6 6 6 6 6 1 1 1 1 1 1 1 1 1 1
symmnumber: 1
zpe: 471913.7 jmol-1
zpe.correction: 0.179742 hartree
zpe.thermalcorrener: 0.190611 hartree
zpe.thermalcorrenthalpy: 0.191555 hartree
zpe.thermalcorrgfe: 0.141004 hartree
zpe.sumelectzpe: -574.682841 hartree
zpe.sumelectthermal: -574.671973 hartree
zpe.sumelectthermalent: -574.671028 hartree
zpe.sumelectthermalfe: -574.721580 hartree
dipole: -6.0101 -2.2610 -1.0227
dipole: 6.5023
quadrupole: -99.0993 -69.4185 -75.6861
quadrupole: -7.4405 -7.3501 -1.7376
quadrupole: -17.6980 11.9828 5.7152 -7.4405 -7.3501 -1.7376
hfenergy: -574.8625835 hartree
pointgroup: C01 [X(C11H10O2)]
dipole: 2.3203811 0.4787163 -0.9648889 debye
dipolederiv: -0.6716403 -0.1880247 0.0214607 -0.2823579 -0.7107634 -0.1731291 -0.0010718 -0.2412444 -0.4398681 -1.178548 -0.4124764 0.1011408 -0.3235536 -0.5738455 -0.0177118 0.2807656 0.0689476 -0.4187135 -0.0823518 -0.0175648 0.0309757 -0.1758469 0.1160697 -0.0156248 0.0045895 -0.0153555 0.0571864 0.4751557 0.1304553 -0.152378 0.3814425 0.1748617 0.0563309 -0.1887062 0.1115875 -0.0026681 0.2530172 0.0202244 0.1266413 0.0731473 -0.0151556 0.0067099 0.2843499 0.0207031 0.0099563 0.3455909 0.0615788 0.0442382 -0.0744613 0.1396591 -0.1310663 -0.0366156 -0.2025795 0.1557319 -0.7275908 -0.0963746 0.1581955 -0.074212 -0.1084061 0.0857837 0.3089513 0.110292 -0.1839467 -0.1850227 0.0069992 0.0138978 0.0458239 -0.0199954 -0.1187213 -0.0069905 -0.1218059 -0.0443874 -0.1426199 0.0849079 -0.0229657 0.0897457 -0.0426023 -0.0408878 -0.0512885 -0.0467731 -0.1320988 1.6544319 0.5999899 -0.2637073 0.5065708 0.9272044 0.2236397 -0.467533 0.1745003 0.6390963 0.0135456 0.1095388 0.0183887 0.1104238 0.0185446 -0.0524306 -0.0113079 -0.0602261 -0.0822477 -0.0425734 0.0160528 0.0427647 0.0046633 0.0211916 -0.1293833 0.0606894 -0.1231551 -0.0042086 0.0134046 0.0185572 0.1140417 0.009807 -0.1133408 -0.0289601 0.1083375 -0.0321523 -0.068866 0.0098777 -0.0311986 0.0394864 0.0307097 -0.0470032 0.1231083 0.0265204 0.0681518 0.0331151 -0.0248396 -0.0209127 -0.0455635 0.0047651 -0.0162916 -0.1290734 -0.0224713 -0.0653788 -0.0073471 -0.0253725 -0.0375838 -0.0684331 -0.0312631 0.0858357 0.02973 -0.1163436 -0.0055756 0.0132779 0.0520474 -0.0151059 0.0226786 -0.0402348 -0.0699886 0.0512497 0.014977 0.0922316 0.0701219 0.1323169 -0.0097925 0.037466 -0.0018381 0.0657806 -0.095916 0.045188 -0.0894828 0.080518 0.1000762 0.0304046 -0.065605 0.012152 0.0141532 0.1165137 -0.0448393 0.1252955 0.014254 0.023986 -0.1163819 0.0035233 -0.1321996 0.0264463 0.0350111 0.0026649 0.0290891 0.1055917 -0.0168825 -0.1158973 -0.0017068 -0.1312261 0.0064814 0.0484136 -0.007251 0.0502731 0.1159403 0.0801367 0.0002915 -0.0394581 0.0161947 0.0071162 0.1262936 -0.058197 0.1231171 0.0249267 -0.0561455 -0.0176872 -0.1150821 -0.0182525 0.1140481 0.0301202 -0.1244181 0.0295406 0.0646352 unknown
polarizability: 160.7275454|29.5024798|103.0505018|9.4393297|-11.4439726|90.502435 unknown
InChI: InChI=1S/C11H10O2/c12-11-7-10(8-13-11)6-9-4-2-1-3-5-9/h1-5,7H,6,8H2
charge 0 multiplicity 1
23 atoms
O  -2.826794 0.63206 0.960148
O  -4.374202 -1.080076 0.528731
C  0.050981 0.040881 -1.507961
C  -1.210677 -0.007063 -0.679937
C  1.335595 0.041976 -0.671974
C  -1.51051 1.014208 0.404056
C  -2.246263 -0.890712 -0.740174
C  2.329067 1.031696 -0.871937
C  1.559467 -0.964536 0.302974
C  -3.288102 -0.540944 0.26088
C  3.524575 1.017231 -0.11647
C  2.751926 -0.981203 1.05911
C  3.739416 0.010723 0.852073
H  0.035349 0.953464 -2.137654
H  0.053183 -0.819995 -2.20319
H  -0.767411 0.99813 1.221536
H  -1.586035 2.044109 0.007089
H  -2.355621 -1.748036 -1.404119
H  2.169705 1.816273 -1.622285
H  0.797681 -1.736628 0.469114
H  4.2841 1.789101 -0.283522
H  2.911535 -1.765393 1.807568
H  4.664436 -0.001365 1.438845
