program: Gaussian 09
title: 000291933
version: EM64L-G09RevD.01
frameworkgroup: C1[X(C14H18N2O6S)]
method: RPBEPBE
basis: SDD
operation: Freq
keyword: #p
keyword: freq=noraman
keyword: PBEPBE/SDD
title: #p freq=noraman PBEPBE/SDD
converged: YES YES NO NO
title: Mulliken charges:
elementType: S O O O O O O N N C C C C C C C C C C C C C C H H H H H H H H H H H H H H H H H H
charge: 0.947806 -0.254234 -0.249278 -0.541099 -0.542121 -0.221182 -0.228042 -0.040035 -0.717029 -0.364716 -0.054122 0.263749 -0.243579 -0.225643 -0.212090 -0.320839 -0.350715 0.245589 0.256029 -0.262051 -0.263661 -0.659654 -0.660822 0.314495 0.265324 0.283365 0.284631 0.273649 0.263777 0.230256 0.238658 0.238031 0.229547 0.334407 0.334648 0.222635 0.250361 0.231136 0.231120 0.250287 0.221413
chargesum: 0.00000
title: Mulliken charges with hydrogens summed into heavy atoms:
elementType: S O O O O O O N N C C C C C C C C C C C C C C
charge: 0.947806 -0.254234 -0.249278 -0.541099 -0.542121 -0.221182 -0.228042 -0.040035 -0.047974 -0.050221 -0.054122 0.263749 0.021745 0.057722 0.072542 -0.047190 -0.086938 0.245589 0.256029 0.206863 0.203917 0.044477 0.041998
polarizability: 3.27558325e+02 4.03629854e+00 1.98458465e+02 7.48764884e-01 -2.07906746e+01 1.57967486e+02
1716.lowfreq: -12.4144 -5.5237 -2.6160 -0.0008 0.0014 0.0014 5.2449 9.5197 15.0743
frequency: -7.7565 8.5510 14.6360 27.5586 32.4787 33.5096 44.2737 60.0372 71.2847 76.6583 95.2599 101.4251 109.3147 130.7364 146.8721 152.2199 177.9186 197.9267 200.6928 227.6024 260.4956 264.9445 279.3768 289.1301 304.2125 311.9005 331.0822 343.3453 378.6702 405.2891 413.7230 433.3107 433.9871 444.5238 471.2288 511.3762 549.0561 562.8777 617.6189 633.7300 655.8462 691.5159 732.4343 741.5121 780.9928 784.6203 793.4514 807.9005 812.6230 815.3042 823.1464 840.5863 854.4450 907.1792 912.1667 921.6818 966.5330 978.0152 989.2552 994.4892 1005.5966 1015.7143 1050.8834 1069.3442 1092.4978 1095.6258 1107.8718 1110.8492 1114.4367 1148.2818 1157.3242 1157.7004 1172.5713 1197.6956 1254.8899 1271.9464 1276.1806 1276.8859 1288.9777 1353.0891 1354.3978 1357.8979 1377.4412 1391.0850 1392.9886 1403.3607 1456.9401 1457.9363 1462.1933 1463.0845 1464.9243 1483.4009 1484.1762 1532.6399 1578.3252 1591.5391 1623.3306 1630.0120 1656.6366 2995.5029 2995.8202 3012.0209 3034.2262 3035.5182 3068.4229 3090.9938 3091.0946 3097.2701 3098.0224 3124.1949 3124.8477 3146.4779 3156.5035 3165.9555 3176.3735 3365.3775 3533.4917
redmass: 3.7429 5.7193 4.0390 4.2591 5.4819 3.1954 3.5313 3.8098 5.9495 5.6691 3.1998 1.9797 5.1624 4.8320 4.1065 7.3843 3.9187 1.4567 2.0050 2.2385 2.4700 2.5249 7.6458 3.9096 2.9371 5.5452 4.9298 6.9192 5.7824 5.6269 3.0610 5.6957 4.5505 3.8378 4.1578 4.5424 3.1147 6.3285 7.0918 5.5192 5.6211 4.4811 3.7034 3.5462 3.3715 2.6070 2.3748 2.5944 1.5663 1.8461 3.4484 1.2396 1.6426 3.9740 2.9788 3.6487 1.3597 1.4018 2.9423 2.4344 2.6490 2.8694 2.5043 1.4827 2.3173 2.1856 4.6785 2.6052 1.4375 2.6788 1.6948 1.7191 1.2515 2.5466 1.6093 1.5548 1.1487 1.2044 1.2610 1.2957 1.2851 1.5580 3.8560 1.2299 1.2308 3.8280 1.0945 1.0935 1.0459 1.0467 2.3099 1.0519 1.0524 1.0853 6.8622 6.9161 8.9127 10.0191 8.1957 1.0360 1.0361 1.0895 1.0598 1.0599 1.0835 1.0975 1.0973 1.1028 1.1028 1.1067 1.1068 1.0887 1.0887 1.0968 1.0975 1.0414 1.1001
irintensity: 1.3311 0.0495 0.2385 0.7392 0.2582 3.5936 0.5590 2.9665 0.5868 1.5885 6.3635 35.1136 2.2714 1.2112 0.5630 3.0699 0.9876 7.2527 9.1008 3.7858 1.9754 4.2266 26.0992 7.7221 8.5885 12.1762 16.9028 2.7969 2.6497 15.5472 0.7937 71.7249 11.3729 0.6076 157.8550 38.6052 72.8194 9.1551 0.0693 1.0504 17.4457 2.1811 2.8771 4.1709 12.9313 23.3645 36.4255 159.7663 43.8784 15.8405 27.5965 0.6324 68.0986 58.8797 18.3685 2.2187 0.1924 0.3873 3.6418 5.1175 50.9603 122.3765 41.6648 27.3411 79.9574 45.1077 136.3911 109.0180 24.6328 333.1999 24.8875 56.7081 66.0215 97.5216 75.5160 150.3226 22.3327 57.6308 1.6024 5.7885 2.4454 6.4367 1.9077 20.7786 23.4681 14.2581 14.0310 16.8591 14.8424 11.9838 30.2065 15.5454 13.5387 19.5564 14.6559 36.0768 141.0749 161.6050 153.3704 17.8567 14.2180 14.8455 28.4427 27.6721 3.1493 25.4290 41.6536 1.6745 1.7302 26.4502 29.4406 0.9828 1.2923 2.3305 4.1237 28.8586 24.3153
temp: 298.150 k
press: 1.00000 atm
elementType: 16 8 8 8 8 8 8 7 7 6 6 6 6 6 6 6 6 6 6 6 6 6 6 1 1 1 1 1 1 1 1 1 1 1 1 1 1 1 1 1 1
symmnumber: 1
zpe: 805357.9 jmol-1
zpe.correction: 0.306745 hartree
zpe.thermalcorrener: 0.331899 hartree
zpe.thermalcorrenthalpy: 0.332844 hartree
zpe.thermalcorrgfe: 0.246177 hartree
zpe.sumelectzpe: -1501.269467 hartree
zpe.sumelectthermal: -1501.244312 hartree
zpe.sumelectthermalent: -1501.243368 hartree
zpe.sumelectthermalfe: -1501.330034 hartree
dipole: 6.3505 -0.8981 -3.2703
dipole: 7.1993
quadrupole: -130.5200 -128.3167 -151.9515
quadrupole: 11.9834 14.3192 -2.9898
quadrupole: 6.4094 8.6127 -15.0221 11.9834 14.3192 -2.9898
hfenergy: -1501.5762114 hartree
pointgroup: C01 [X(C14H18N2O6S1)]
dipole: -2.5506081 0.1280567 1.2250271 debye
polarizability: 323.9323197|-20.5148563|205.8877276|9.5762681|14.4656896|154.164229 unknown
InChI: InChI=1S/C14H18N2O6S/c1-3-21-13(17)12(14(18)22-4-2)9-16-10-5-7-11(8-6-10)23(15,19)20/h5-9,12H,3-4,15H2,1-2H3
charge 0 multiplicity 1
41 atoms
S  5.919641 -0.740899 -0.037968
O  -4.449067 -0.755709 0.079837
O  -3.490093 2.536391 0.218166
O  6.07034 -1.680527 -1.360257
O  6.709437 0.670562 0.15819
O  -2.511224 -1.9810 -0.366673
O  -2.963358 1.591308 -1.855212
N  0.006569 0.364823 0.842446
N  6.388124 -1.79686 1.39939
C  -2.35945 0.417741 0.233287
C  4.090411 -0.414369 0.228111
C  1.379868 0.093919 0.589674
C  -0.885719 0.253011 -0.093732
C  3.168634 -1.308151 -0.33948
C  3.721195 0.71879 0.973584
C  1.796137 -1.045712 -0.157292
C  2.347953 0.961349 1.165193
C  -3.081483 -0.910764 -0.060441
C  -2.966336 1.553212 -0.60413
C  -5.295509 -1.976432 -0.145466
C  -4.101531 3.726231 -0.465501
C  -5.395594 -2.806476 1.135763
C  -3.032505 4.776804 -0.773604
H  -2.475261 0.65737 1.303473
H  -0.649079 0.040391 -1.153949
H  3.515518 -2.166936 -0.922875
H  4.484798 1.39221 1.374855
H  1.045168 -1.732188 -0.563024
H  2.005096 1.819173 1.750854
H  -6.266832 -1.556048 -0.449072
H  -4.852513 -2.556158 -0.973739
H  -4.605606 3.376951 -1.38338
H  -4.841955 4.08439 0.266639
H  7.105406 -1.289505 1.944088
H  6.722447 -2.702753 1.030333
H  -6.090338 -3.65123 0.973539
H  -4.412769 -3.220531 1.416092
H  -5.782399 -2.198569 1.971429
H  -2.49166 5.070343 0.142286
H  -2.307925 4.397045 -1.513113
H  -3.512034 5.679502 -1.195219
