program: Gaussian 09
title: 000291924
version: EM64L-G09RevD.01
frameworkgroup: C1[X(C12H8BrN3O4)]
method: RPBEPBE
basis: SDD
operation: Freq
keyword: #p
keyword: freq=noraman
keyword: PBEPBE/SDD
title: #p freq=noraman PBEPBE/SDD
converged: YES YES NO NO
title: Mulliken charges:
elementType: Br O O O O N N N C C C C C C C C C C C C H H H H H H H H
charge: 0.039068 -0.181716 -0.258421 -0.209243 -0.202484 -0.471778 0.025164 0.016876 0.332060 0.230433 0.434683 -0.309787 -0.500510 0.446783 -0.402585 -0.408970 -0.364178 -0.146033 -0.163515 -0.237635 0.356674 0.286638 0.337457 0.294855 0.259934 0.278642 0.259143 0.258442
chargesum: 0.00000
title: Mulliken charges with hydrogens summed into heavy atoms:
elementType: Br O O O O N N N C C C C C C C C C C C C
charge: 0.039068 -0.181716 -0.258421 -0.209243 -0.202484 -0.115104 0.025164 0.016876 0.332060 0.230433 0.434683 -0.023148 -0.163053 0.446783 -0.107730 -0.149037 -0.085536 0.113110 0.094928 -0.237635
polarizability: 4.09790711e+02 5.07195926e+00 2.07619852e+02 1.03182601e+01 8.62079609e+00 8.31285059e+01
1716.lowfreq: -3.5790 -2.1056 -0.0007 -0.0005 0.0000 7.2440 28.1940 32.7854 47.0830
frequency: 28.1797 32.7842 47.0675 59.4263 74.1227 113.7509 130.0705 150.4527 168.6774 175.3684 209.1902 280.5666 299.8830 310.7679 332.3811 370.2056 380.3047 408.8908 426.6152 445.1296 497.9662 506.5398 514.7940 571.0788 617.1916 628.8214 648.8517 665.9442 678.8248 705.3976 708.1137 723.3905 752.8885 793.4483 813.7393 821.3467 838.4049 848.4222 860.7682 898.1373 955.3829 966.8294 968.1858 993.1492 1002.7082 1050.8719 1062.6054 1104.5618 1115.8412 1145.6249 1162.0105 1187.6329 1205.6508 1231.9109 1246.9547 1295.1909 1308.6741 1344.4032 1359.6739 1364.1547 1382.9210 1406.6367 1448.6872 1474.1565 1489.4462 1526.0655 1574.7224 1591.4386 1598.4015 1624.4513 3147.1143 3154.9464 3173.1817 3175.4237 3178.3266 3187.9382 3191.6035 3217.8776
redmass: 8.7390 8.5602 5.7690 12.2135 11.1739 8.0203 8.5788 17.4941 5.8874 9.5003 7.6664 6.7741 6.6062 9.3659 9.6490 6.0789 11.5706 2.9902 5.4678 4.5314 5.6445 3.9774 3.6121 6.4159 7.1579 7.0136 7.5091 8.7213 6.4939 7.4616 4.1731 5.0891 12.3265 3.5976 1.3342 1.3149 2.6488 1.7154 1.7359 5.7288 1.3292 1.3811 1.3826 4.5707 1.3064 2.2740 2.6179 3.5655 1.4349 1.4819 7.7189 1.1305 3.9595 3.7604 1.6825 1.3416 2.1669 5.5676 3.2533 8.9321 7.1485 3.4240 5.5326 2.4389 3.3284 3.3494 8.0253 4.0460 4.1758 7.0206 1.0903 1.0889 1.0904 1.0944 1.0969 1.0920 1.0970 1.0785
irintensity: 1.5443 1.8073 0.2053 0.4850 0.7161 1.7780 0.1928 1.1627 2.5319 2.9812 0.7099 2.9232 0.8833 4.5773 8.8104 3.5506 1.3546 0.2145 0.4534 2.2381 6.7568 24.5888 18.9371 5.7536 3.7328 8.4193 16.2627 11.1656 5.7172 8.5912 3.3270 2.2050 6.7093 30.8448 14.8929 25.8368 42.9685 54.0556 45.8371 11.2181 1.1198 11.2836 17.1416 69.5830 0.4187 15.1893 65.3817 46.7862 23.5306 11.0770 364.6395 3.0580 533.3397 132.0090 20.5667 12.4412 73.1256 219.5857 41.5150 47.3196 22.7602 7.3124 2.6431 152.0930 170.1057 116.8383 29.6679 116.6895 54.5286 388.4646 3.6429 5.7168 0.6278 5.2768 0.1073 17.2678 4.7647 132.7113
temp: 298.150 k
press: 1.00000 atm
elementType: 35 8 8 8 8 7 7 7 6 6 6 6 6 6 6 6 6 6 6 6 1 1 1 1 1 1 1 1
symmnumber: 1
zpe: 491385.6 jmol-1
zpe.correction: 0.187159 hartree
zpe.thermalcorrener: 0.204068 hartree
zpe.thermalcorrenthalpy: 0.205012 hartree
zpe.thermalcorrgfe: 0.139474 hartree
zpe.sumelectzpe: -939.127654 hartree
zpe.sumelectthermal: -939.110745 hartree
zpe.sumelectthermalent: -939.109801 hartree
zpe.sumelectthermalfe: -939.175339 hartree
dipole: 6.1777 -0.5724 0.6610
dipole: 6.2393
quadrupole: -168.2640 -138.8100 -121.2272
quadrupole: -2.5863 -0.1125 6.4018
quadrupole: -25.4969 3.9571 21.5398 -2.5863 -0.1125 6.4018
hfenergy: -939.3148126 hartree
pointgroup: C01 [X(C12H8Br1N3O4)]
dipole: -2.3845273 -0.5374113 -0.2254747 debye
polarizability: 407.9885883|20.4179995|208.1587795|9.6590761|-14.6745875|84.3917009 unknown
InChI: InChI=1S/C12H8BrN3O4/c13-8-1-3-9(4-2-8)14-11-6-5-10(15(17)18)7-12(11)16(19)20/h1-7,14H
charge 0 multiplicity 1
28 atoms
Br -6.571308 -1.571201 0.146505
O  2.59938 3.235567 0.232824
O  0.355561 3.183105 -0.145011
O  4.358456 -2.771241 -0.076839
O  5.319857 -0.703516 0.091035
N  -0.891435 0.893483 -0.197586
N  1.51393 2.579804 0.021373
N  4.292798 -1.479937 -0.014719
C  0.355824 0.311013 -0.155642
C  1.557412 1.117318 -0.043735
C  -2.168295 0.264911 -0.1229
C  0.543337 -1.110597 -0.254308
C  2.839082 0.528628 0.008266
C  2.955701 -0.862812 -0.067938
C  1.808446 -1.689989 -0.216936
C  -3.224667 0.819431 -0.892081
C  -2.438108 -0.823164 0.748656
C  -4.526659 0.284867 -0.812531
C  -3.736624 -1.367892 0.824527
C  -4.769969 -0.813429 0.039592
H  -0.848934 1.93056 -0.267674
H  -0.332318 -1.745114 -0.405454
H  3.725563 1.160737 0.104499
H  1.942909 -2.770733 -0.31141
H  -3.024854 1.662641 -1.561931
H  -1.654816 -1.220572 1.400712
H  -5.33434 0.714037 -1.411627
H  -3.940929 -2.201304 1.502434
