program: Gaussian 09
title: 000291962
version: EM64L-G09RevD.01
frameworkgroup: C1[X(C13H25O7P)]
method: RPBEPBE
basis: SDD
operation: Freq
keyword: #p
keyword: freq=noraman
keyword: PBEPBE/SDD
title: #p freq=noraman PBEPBE/SDD
converged: YES YES NO NO
title: Mulliken charges:
elementType: P O O O O O O O C C C C C C C C C C C C C H H H H H H H H H H H H H H H H H H H H H H H H H
charge: 1.238361 -0.536776 -0.537283 -0.617370 -0.264746 -0.223766 -0.265280 -0.248778 -0.629653 -0.366782 -0.502258 0.312249 0.063909 0.050077 -0.665547 -0.659989 -0.675388 -0.672804 0.239419 -0.506854 -0.505807 0.328239 0.257522 0.247495 0.299409 0.276643 0.214642 0.219286 0.228428 0.205826 0.237889 0.229152 0.200886 0.244372 0.239650 0.205794 0.220522 0.256006 0.210228 0.214132 0.246190 0.247681 0.232638 0.231890 0.240744 0.239801
chargesum: 0.00000
title: Mulliken charges with hydrogens summed into heavy atoms:
elementType: P O O O O O O O C C C C C C C C C C C C C
charge: 1.238361 -0.536776 -0.537283 -0.617370 -0.264746 -0.223766 -0.265280 -0.248778 -0.301414 0.138235 0.073794 0.312249 0.278550 0.269363 0.006597 0.014420 -0.009422 0.007562 0.239419 0.219654 0.206629
polarizability: 2.22067092e+02 1.08864477e+01 1.88182582e+02 -3.58017369e+00 -2.63953807e+00 1.64775742e+02
1716.lowfreq: -5.1905 -3.3826 -0.0019 -0.0018 -0.0012 6.1825 7.5963 16.3887 26.3579
frequency: 5.2139 16.0426 26.1080 31.2809 33.2733 34.9441 41.0249 42.0010 57.3358 81.3298 92.6664 95.2147 107.4405 113.7946 126.3627 147.2035 158.5810 175.8709 177.4440 197.3026 197.5873 203.7468 218.2138 234.1461 239.4589 245.0812 266.1027 280.8302 306.0368 326.0239 338.8188 352.1347 368.0788 402.1624 407.3976 426.6565 436.5538 467.4427 527.5920 555.7098 607.9625 644.6180 658.1289 671.7768 707.3299 747.2912 786.2967 828.0772 837.8054 843.1715 854.0884 907.0571 915.3261 924.5355 928.2293 931.3161 935.0985 935.2917 953.8152 1001.9421 1024.9161 1044.0611 1086.7649 1091.9745 1100.8671 1112.9841 1113.1105 1134.5343 1142.1715 1148.4337 1149.2748 1153.0387 1153.8700 1181.0542 1182.5608 1185.2597 1224.2270 1279.9458 1292.3162 1321.9373 1324.0250 1330.9950 1333.3194 1335.6828 1375.5739 1378.4412 1380.1348 1391.1313 1393.3121 1420.9136 1422.4622 1446.2316 1452.3644 1452.7469 1453.4690 1454.0787 1461.7551 1463.3202 1464.3597 1465.0839 1466.7766 1467.9977 1471.4125 1487.1885 1488.0723 1639.1660 1642.9383 2982.3555 2987.1803 2987.8658 2989.4825 2991.5340 2993.9552 3002.2136 3002.7705 3006.9424 3014.7635 3034.7443 3056.2561 3079.3691 3083.6812 3084.7576 3089.4368 3090.9521 3095.6091 3101.3825 3101.6158 3103.5787 3107.0587 3110.7491 3146.4741 3151.4261
redmass: 4.8628 5.5331 4.1593 3.4023 3.1254 3.2673 3.1788 4.7668 4.1988 3.5422 1.8793 1.4755 1.4514 2.4188 4.4186 4.8095 4.1846 3.2007 3.3594 1.0871 1.0449 3.9150 4.0225 1.4590 2.4081 1.4150 2.4151 4.0036 3.2277 4.4530 3.5070 3.1467 4.4007 4.1482 3.2637 3.8590 3.0336 3.5121 6.0465 2.8678 5.3240 5.1685 4.3500 4.4618 5.3843 3.2548 2.2403 4.7894 4.3943 5.4394 4.1325 3.0414 3.1074 1.2269 1.3098 4.8947 1.3422 1.3185 5.0649 3.4848 10.3127 2.1708 3.5046 1.6362 1.8533 1.2682 1.2909 2.5409 3.0299 1.4466 1.4621 2.0073 2.0175 1.8333 1.9658 1.2973 1.2850 1.6410 1.1710 1.4278 1.4123 1.3851 1.2518 1.2827 1.2584 1.2578 1.5340 1.2253 1.2223 1.1839 1.1990 1.0770 1.0503 1.0494 1.0502 1.0506 1.0500 1.0749 1.0503 1.0555 1.0484 1.0496 1.0490 1.0481 1.0484 8.6161 8.9402 1.0352 1.0413 1.0726 1.0359 1.0432 1.0856 1.0511 1.0400 1.0294 1.0632 1.0823 1.1001 1.0990 1.0988 1.0977 1.0991 1.0986 1.1012 1.1011 1.1007 1.1044 1.1008 1.1047 1.1047 1.1050
irintensity: 0.4302 0.6415 1.3826 0.5490 0.1571 1.0533 0.7887 1.5428 1.0251 1.7386 0.3667 0.3852 0.1009 1.0816 2.5270 0.4290 1.4542 11.5823 13.9424 0.2414 0.0535 0.6684 9.7846 2.9166 1.9076 2.7113 4.9595 24.1457 8.8789 13.8497 8.5971 5.4777 22.4274 22.0324 1.4626 11.6095 10.1156 11.5998 22.8880 2.6586 9.3027 35.5540 5.5976 38.6439 19.9014 30.1382 16.7217 138.4754 103.8029 161.9572 31.7306 108.9432 112.5888 3.4302 3.3984 5.9268 0.8409 0.2658 35.5922 22.3297 87.6312 6.1798 172.6365 73.0407 116.1083 1.0504 2.5446 114.2197 238.1704 0.9645 4.8581 10.6298 14.2607 12.0294 18.2921 47.8436 9.0690 60.9461 28.9047 9.2860 16.5950 42.9255 50.2662 40.0247 31.8779 27.6699 26.2550 30.6155 27.6427 21.2738 30.0674 17.4440 12.9631 13.4355 6.4069 6.5369 11.6395 18.3114 9.4146 20.4258 9.3049 5.6151 5.4352 13.0210 20.1472 115.0557 221.0545 16.1302 13.6137 18.1386 23.9874 22.4767 13.8753 35.2998 21.0462 28.8160 19.9583 1.9609 3.4571 11.7967 2.4522 0.7677 53.3278 56.8712 12.8526 11.8183 36.7590 28.0667 26.2401 22.3524 16.7535 14.6871
temp: 298.150 k
press: 1.00000 atm
elementType: 15 8 8 8 8 8 8 8 6 6 6 6 6 6 6 6 6 6 6 6 6 1 1 1 1 1 1 1 1 1 1 1 1 1 1 1 1 1 1 1 1 1 1 1 1 1
symmnumber: 1
zpe: 978316.7 jmol-1
zpe.correction: 0.372621 hartree
zpe.thermalcorrener: 0.400607 hartree
zpe.thermalcorrenthalpy: 0.401551 hartree
zpe.thermalcorrgfe: 0.307934 hartree
zpe.sumelectzpe: -1376.474934 hartree
zpe.sumelectthermal: -1376.446948 hartree
zpe.sumelectthermalent: -1376.446004 hartree
zpe.sumelectthermalfe: -1376.539622 hartree
dipole: 3.0586 0.0701 2.2109
dipole: 3.7747
quadrupole: -116.1492 -122.0509 -142.4418
quadrupole: 10.9477 -2.3187 -1.9251
quadrupole: 10.7314 4.8297 -15.5612 10.9477 -2.3187 -1.9251
hfenergy: -1376.8475553 hartree
pointgroup: C01 [X(C13H25O7P1)]
dipole: 1.2167888 -0.0854082 -0.8470981 debye
polarizability: 219.7019854|-13.8585218|190.645377|3.8711434|-1.8096248|164.6780537 unknown
InChI: InChI=1S/C13H25O7P/c1-9(2)19-21(16,20-10(3)4)11(13(15)18-6)7-8-12(14)17-5/h9-11H,7-8H2,1-6H3
charge 0 multiplicity 1
46 atoms
P  0.867728 0.300893 0.801251
O  0.289189 1.305692 -0.466445
O  2.434886 -0.149816 0.196933
O  0.890216 0.910755 2.276677
O  0.952963 -2.927332 -0.585171
O  -0.6557 -1.735645 -1.773116
O  -4.596794 1.051096 -0.245545
O  -4.575079 -0.831699 1.123627
C  -0.228296 -1.248712 0.630274
C  -1.704647 -0.962626 1.010412
C  -2.484269 -0.040521 0.050387
C  -0.034801 -1.945964 -0.707523
C  1.00915 2.592879 -0.790358
C  3.569672 -0.369013 1.164315
C  -0.049049 3.700043 -0.755259
C  1.678401 2.404306 -2.156165
C  4.485531 -1.375558 0.462813
C  4.235849 0.976711 1.481455
C  -3.959869 -0.018881 0.393348
C  1.285969 -3.655277 -1.834619
C  -6.060255 1.147472 -0.027232
H  0.211427 -1.908173 1.401934
H  -1.714137 -0.535257 2.030655
H  -2.228999 -1.934082 1.077555
H  -2.371993 -0.39603 -0.991328
H  -2.089591 0.989203 0.054477
H  1.773676 2.771699 -0.007168
H  3.152625 -0.803775 2.094934
H  -0.853094 3.48222 -1.480021
H  0.408274 4.670984 -1.021619
H  -0.494124 3.784772 0.250508
H  0.919519 2.160298 -2.919902
H  2.196636 3.333418 -2.45934
H  2.412927 1.582643 -2.114168
H  3.926954 -2.295374 0.219805
H  5.337963 -1.635907 1.116911
H  4.881412 -0.945794 -0.474251
H  3.52647 1.643769 2.000943
H  5.111462 0.821999 2.139256
H  4.581902 1.461021 0.550532
H  0.387679 -4.15113 -2.23854
H  1.682731 -2.950888 -2.58457
H  2.046974 -4.38987 -1.537188
H  -6.371949 2.029339 -0.604322
H  -6.2800 1.275732 1.046101
H  -6.563133 0.235478 -0.391053
