program: Gaussian 09
title: 000291964
version: EM64L-G09RevD.01
frameworkgroup: C1[X(C22H26O6)]
method: RPBEPBE
basis: SDD
operation: Freq
keyword: #pfreq=noraman
keyword: PBEPBE/SDD
title: #p freq=noraman PBEPBE/SDD
converged: YES YES NO NO
title: Mulliken charges:
elementType: O O O O O O C C C C C C C C C C C C C C C C C C C C C C H H H H H H H H H H H H H H H H H H H H H H H H H H
charge: -0.263605 -0.263604 -0.252945 -0.252947 -0.265861 -0.265861 -0.277491 -0.277502 -0.542356 -0.542348 0.512447 0.512457 -0.394119 -0.394119 -0.429672 -0.429671 0.253965 0.253960 -0.380550 -0.380550 -0.359249 -0.359254 0.312462 0.312462 -0.505679 -0.505678 -0.538012 -0.538012 0.247310 0.247301 0.265735 0.249276 0.265732 0.249282 0.229625 0.229616 0.249532 0.249532 0.238852 0.238850 0.249222 0.249222 0.238706 0.244255 0.232261 0.232260 0.238702 0.244258 0.244819 0.220467 0.220616 0.244818 0.220617 0.220466
chargesum: 0.00000
title: Mulliken charges with hydrogens summed into heavy atoms:
elementType: O O O O O O C C C C C C C C C C C C C C C C C C C C C C
charge: -0.263605 -0.263604 -0.252945 -0.252947 -0.265861 -0.265861 -0.030181 -0.030201 -0.027345 -0.027334 0.512447 0.512457 -0.164495 -0.164503 -0.180140 -0.180140 0.253965 0.253960 -0.141698 -0.141699 -0.110027 -0.110031 0.312462 0.312462 0.209542 0.209542 0.147890 0.147889
polarizability: 3.48458139e+02 -2.32753750e+01 2.23882822e+02 -1.37586101e+00 1.51474008e+01 2.15458066e+02
1716.lowfreq: -4.8519 -1.4078 -0.0005 0.0010 0.0013 5.0266 17.0831 18.1781 18.6288
frequency: 17.0831 18.1101 18.6288 26.1690 32.9341 37.5645 37.7908 43.7533 64.7472 67.2447 95.5567 98.3638 99.2436 113.2653 123.7383 140.0745 141.7760 160.8230 162.3920 166.9915 190.8798 199.4378 228.5576 228.9862 245.8680 260.1764 262.1953 275.5806 301.3210 312.2945 362.0384 382.7479 401.6974 413.5071 413.5939 450.6444 464.8245 486.8138 489.2713 511.2754 546.1940 555.5526 560.5285 573.8503 596.1372 631.3253 634.6965 665.9458 686.6831 695.1479 727.9553 740.6003 747.3323 794.9247 804.4128 813.7258 815.6011 825.0847 835.6890 839.2109 847.1392 934.8646 939.1550 944.8374 955.0373 960.3221 966.0113 966.7421 969.7949 988.5034 989.1901 1002.2726 1003.5277 1038.2746 1043.2657 1083.4666 1107.8661 1111.2324 1112.0100 1112.1362 1112.4557 1112.8780 1119.0147 1132.7813 1148.1363 1148.2507 1155.9125 1156.3048 1178.2703 1182.4565 1189.2391 1195.0688 1216.0627 1218.0832 1226.5781 1230.8198 1234.5663 1286.1167 1295.3790 1302.5127 1314.3275 1332.5912 1342.8347 1343.1976 1388.7594 1391.5605 1418.4768 1420.6032 1420.6276 1422.8873 1435.6328 1435.9461 1439.2236 1439.6914 1452.1628 1452.1655 1463.5604 1463.5747 1465.6132 1465.6153 1472.5556 1472.8585 1501.1248 1501.4540 1581.8785 1583.4185 1621.6413 1622.0191 1637.0221 1638.3829 2956.9810 2957.0675 2989.6005 2989.7108 2993.7218 3003.4945 3003.5653 3010.3860 3043.9411 3043.9610 3072.6289 3073.4608 3105.5001 3105.5220 3120.3108 3120.5392 3123.8139 3123.8212 3132.8009 3132.8145 3148.0332 3148.0367 3159.0174 3159.0346 3165.8456 3165.9122
redmass: 5.2589 4.5166 4.3268 5.4344 3.6448 4.4110 3.9137 6.7167 5.0009 3.5224 3.4751 1.1010 1.1256 3.8966 4.5942 4.0155 4.3011 3.7599 3.8611 3.7823 3.8943 6.4851 1.2573 1.3825 3.3732 2.5577 2.5993 3.4725 4.8485 4.5204 4.6233 3.8163 4.2746 2.9338 2.9339 4.1233 4.3484 3.9341 3.6845 3.6514 3.1818 4.0164 3.0820 3.1991 2.9240 6.5515 6.8570 4.9946 4.5501 4.2514 3.4901 3.5824 4.1509 5.2463 3.0673 1.3725 1.4553 5.8971 1.7489 1.6256 3.4284 1.6847 1.4057 4.2039 2.0471 2.8105 1.8379 1.4134 2.2423 8.1267 8.2549 2.7846 2.6452 3.9754 4.4810 3.3144 1.4508 1.4466 1.2631 1.2972 1.2774 1.3172 1.8944 1.9410 1.4447 1.4508 1.3517 1.3499 1.2800 1.2805 1.9406 1.9326 1.7144 1.5707 1.8975 3.0530 2.0139 1.4861 1.4063 1.4014 1.4354 1.5124 2.0699 1.4912 3.8491 3.0347 2.8408 1.2165 1.1927 2.3535 1.1650 1.1749 1.1083 1.1126 1.0505 1.0505 1.0505 1.0505 1.0502 1.0503 1.0766 1.0748 2.4317 2.4170 7.0239 6.7260 6.3304 6.3053 9.1475 9.0900 1.0330 1.0331 1.0630 1.0631 1.0820 1.0295 1.0295 1.0840 1.1039 1.1039 1.0965 1.0960 1.1045 1.1045 1.0888 1.0891 1.0988 1.0987 1.0893 1.0893 1.1048 1.1048 1.0937 1.0937 1.0957 1.0957
irintensity: 1.1687 0.0000 0.7458 0.0452 0.0000 4.0066 2.7443 0.0000 2.0715 0.0000 8.7882 0.0002 0.5812 0.0000 0.0000 2.6165 0.0000 0.0000 3.0667 12.1251 0.0000 0.0000 2.6561 0.0000 9.6579 0.0001 30.8858 0.0000 11.8027 0.0000 9.6523 0.0000 5.2501 0.0002 0.3357 0.0000 0.7836 9.6250 0.0000 15.0586 0.0000 0.0000 48.0662 35.6392 0.0000 0.0000 1.0484 0.0000 20.4276 41.6494 0.0000 13.4000 0.0000 0.8222 0.0000 35.6864 0.0000 0.0000 62.4202 0.0000 47.2841 17.3279 0.0000 26.7084 44.6563 0.0000 0.0001 4.3746 0.0000 0.0000 72.5222 0.0000 17.4690 45.1836 0.0000 0.0000 80.7844 0.0000 3.3977 0.0001 6.0374 0.0001 351.8912 0.0000 16.4082 0.0004 0.9306 0.0000 183.2088 0.0000 109.8480 0.0001 0.0000 78.2764 178.2272 0.0001 290.5506 54.7415 0.0000 0.0000 21.6423 0.0000 0.0010 97.2871 16.5998 0.0000 3.7962 0.0394 43.8495 0.0000 0.0000 19.3991 23.2176 0.0010 0.2539 26.0535 21.8515 0.1338 3.6500 22.9978 127.4181 0.0010 0.0000 241.5042 0.0000 14.5758 0.0002 100.7916 250.0304 0.0000 139.5588 0.0009 27.3947 0.0069 0.0000 68.4970 0.0828 21.6187 0.0008 97.8326 0.0000 17.4108 1.5591 49.3936 0.0007 53.4500 1.6167 33.1496 0.2026 17.3834 32.7290 0.0185 0.2496 26.4642 11.0347 0.0085
temp: 298.150 k
press: 1.00000 atm
elementType: 8 8 8 8 8 8 6 6 6 6 6 6 6 6 6 6 6 6 6 6 6 6 6 6 6 6 6 6 1 1 1 1 1 1 1 1 1 1 1 1 1 1 1 1 1 1 1 1 1 1 1 1 1 1
symmnumber: 1
zpe: 1139718.3 jmol-1
zpe.correction: 0.434096 hartree
zpe.thermalcorrener: 0.463659 hartree
zpe.thermalcorrenthalpy: 0.464603 hartree
zpe.thermalcorrgfe: 0.368354 hartree
zpe.sumelectzpe: -1303.175730 hartree
zpe.sumelectthermal: -1303.146167 hartree
zpe.sumelectthermalent: -1303.145223 hartree
zpe.sumelectthermalfe: -1303.241472 hartree
dipole: 0.0003 -0.0002 0.0002
dipole: 0.0004
quadrupole: -140.2316 -148.1227 -164.7147
quadrupole: -4.4914 -21.9162 -0.9783
quadrupole: 10.7914 2.9003 -13.6917 -4.4914 -21.9162 -0.9783
hfenergy: -1303.6098259 hartree
pointgroup: C01 [X(C22H26O6)]
dipole: -0.0001284 0.0001059 0.0000552 debye
polarizability: 343.9680569|-32.7163301|227.1397364|2.198842|-15.8582682|216.691234 unknown
InChI: InChI=1S/C22H26O6/c1-25-17-9-5-15(6-10-17)19(13-21(23)27-3)20(14-22(24)28-4)16-7-11-18(26-2)12-8-16/h5-12,19-20H,13-14H2,1-4H3
charge 0 multiplicity 1
54 atoms
O  -1.846341 -3.792842 -0.783519
O  1.839511 3.798667 0.79048
O  -1.295241 -3.146509 1.383552
O  1.28872 3.152157 -1.376619
O  -5.949882 1.545007 0.320848
O  5.943292 -1.538775 -0.313108
C  -0.539973 -0.504968 0.265349
C  0.533221 0.510786 -0.258293
C  -0.475095 -1.83143 -0.544721
C  0.468182 1.837317 0.55165
C  -1.96037 0.066755 0.247593
C  1.953656 -0.060837 -0.240355
C  -2.518198 0.630965 -0.926129
C  2.51143 -0.624868 0.933479
C  -2.776214 0.014559 1.409454
C  2.769595 -0.008704 -1.402152
C  -1.229662 -2.951758 0.146701
C  1.222821 2.957607 -0.139753
C  -3.837071 1.136762 -0.952377
C  3.830341 -1.130559 0.959894
C  -4.093052 0.510741 1.404774
C  4.086471 -0.50478 -1.397305
C  -4.629122 1.076167 0.221564
C  4.622487 -1.070031 -0.213986
C  -2.583672 -4.946837 -0.212751
C  2.577094 4.952506 0.219719
C  -6.54775 2.136577 -0.877689
C  6.541111 -2.130161 0.885544
H  -0.295614 -0.760872 1.315172
H  0.28894 0.766587 -1.308159
H  0.581449 -2.153444 -0.634875
H  -0.868753 -1.703707 -1.567358
H  -0.588385 2.159312 0.641604
H  0.861683 1.709695 1.57436
H  -1.919108 0.689132 -1.843279
H  1.912269 -0.682971 1.850587
H  -2.374297 -0.434907 2.324967
H  2.367719 0.440625 -2.31775
H  -4.229015 1.568813 -1.878116
H  4.222242 -1.562472 1.885716
H  -4.722561 0.46895 2.29888
H  4.716052 -0.463039 -2.291362
H  -1.898582 -5.592659 0.362128
H  -3.388645 -4.591438 0.452088
H  -2.992356 -5.476983 -1.084291
H  2.985781 5.482632 1.09127
H  1.892166 5.59841 -0.35526
H  3.382071 4.596938 -0.445023
H  -7.562178 2.435468 -0.575311
H  -6.606328 1.401554 -1.70432
H  -5.981383 3.02706 -1.214187
H  7.555587 -2.429008 0.583282
H  5.974788 -3.02065 1.222099
H  6.599565 -1.395039 1.712096
