program: Gaussian 09
title: 000291935
version: EM64L-G09RevD.01
frameworkgroup: C1[X(C20H18O2)]
method: RPBEPBE
basis: SDD
operation: Freq
keyword: #pfreq=noraman
keyword: PBEPBE/SDD
title: #p freq=noraman PBEPBE/SDD
converged: YES YES NO NO
title: Mulliken charges:
elementType: O O C C C C C C C C C C C C C C C C C C C C H H H H H H H H H H H H H H H H H H
charge: -0.317813 -0.211479 -0.001111 0.386194 0.364591 0.496396 -0.613020 -0.615925 0.392405 0.078579 0.386329 -0.807016 -0.807178 0.428351 -0.599444 -0.813216 -0.410058 -0.335620 -0.412380 -0.407861 -0.241403 -0.243167 0.238307 0.240431 0.221187 0.226761 0.258513 0.233168 0.261679 0.218667 0.263908 0.238511 0.227602 0.226912 0.238538 0.272861 0.239373 0.240224 0.228671 0.228532
chargesum: 0.00000
title: Mulliken charges with hydrogens summed into heavy atoms:
elementType: O O C C C C C C C C C C C C C C C C C C C C
charge: -0.317813 -0.211479 -0.001111 0.386194 0.364591 0.496396 -0.374713 -0.375495 0.392405 0.078579 0.386329 -0.100555 -0.093662 0.428351 -0.335536 -0.120192 -0.171519 -0.062760 -0.173007 -0.167637 -0.012732 -0.014635
polarizability: 3.88320938e+02 9.04834725e-01 1.82517607e+02 -2.55014019e-01 1.42300138e+01 1.59887954e+02
1716.lowfreq: -8.8163 -0.0006 -0.0004 0.0007 3.6504 6.3938 20.0212 24.8100 35.0710
frequency: 19.7279 24.4257 34.7459 36.9166 65.0787 92.7606 112.1580 152.3492 158.2417 175.8494 179.8347 187.1642 219.6863 230.8566 250.0685 276.4674 304.3160 319.3574 332.5257 375.9373 400.7857 428.0049 466.8159 477.8762 509.1650 511.4725 524.4189 528.3705 530.8874 558.7613 570.0602 602.1407 620.7752 642.8635 685.8188 709.4544 747.5458 758.5459 768.8775 775.6619 785.4474 821.2826 868.4642 870.2500 883.1274 898.5114 908.6883 936.7491 943.7717 955.2220 958.6538 971.9690 991.1925 992.5649 1018.2312 1022.8635 1023.2129 1042.6979 1045.5826 1048.4379 1052.2130 1116.3055 1142.6672 1160.0525 1164.9296 1173.2820 1222.9385 1234.3360 1246.7486 1260.3516 1272.0320 1312.4223 1352.7853 1359.5371 1396.4274 1399.6567 1403.4770 1409.9290 1415.4917 1424.2519 1434.8182 1436.9247 1459.8248 1461.6243 1465.5222 1471.4526 1472.9159 1478.8219 1487.3828 1513.0021 1573.1991 1582.3964 1603.4364 1617.0850 1625.1710 1641.7677 2975.5640 2990.9922 2991.7316 3057.4581 3075.9968 3077.9566 3086.8355 3088.5376 3092.6567 3119.3609 3120.5577 3123.3995 3125.9241 3133.1396 3143.1275 3152.6219 3162.3922 3193.6132
redmass: 4.2784 4.8777 1.3919 2.0667 6.1505 4.9156 5.1834 1.2919 2.4326 1.7752 1.5915 3.6958 2.5849 4.5601 5.4500 2.6894 5.8985 5.2204 2.9475 5.3639 3.2347 4.6718 4.6297 2.5774 3.9233 6.5460 4.1388 3.1760 3.9680 4.4248 4.0915 4.6020 6.0954 3.1416 4.6450 6.1931 2.4733 2.1422 3.7495 2.6829 4.2849 1.4171 1.3185 1.5118 4.7786 1.3047 1.7092 2.7741 3.7940 1.4835 2.9354 1.4127 1.3800 5.4293 1.6559 1.6962 2.1381 1.5547 1.5493 1.6637 1.6779 1.9505 1.8432 1.2411 2.3043 1.0830 2.1118 2.5946 1.5108 1.4872 1.7766 6.6822 1.8209 6.9558 1.2307 1.3741 1.2569 5.7552 1.9285 3.5567 1.9913 3.3633 2.0767 1.1463 1.1007 1.1087 1.0575 1.1716 1.3684 3.7289 7.0097 7.5181 5.8432 5.9141 10.8163 7.0189 1.0387 1.0365 1.0367 1.0947 1.0967 1.0973 1.1000 1.1003 1.1006 1.0910 1.0857 1.0920 1.0891 1.0903 1.0950 1.0924 1.1004 1.0949
irintensity: 0.0853 0.7857 0.2452 0.8847 1.6744 0.4994 0.6019 1.9536 0.7689 2.9259 1.0904 1.1203 0.1209 1.3942 0.3233 0.6453 9.9431 2.0355 0.6486 1.2640 0.0943 0.9388 6.9091 22.2977 3.3805 0.0809 2.1263 2.6105 0.2300 1.9470 0.6517 4.3061 0.7641 1.3730 25.9205 2.2975 19.5592 19.0899 7.2809 6.7268 9.2731 40.1081 18.1387 34.7504 3.1630 0.4127 19.2490 1.0347 0.0447 18.9398 30.1794 10.9054 20.8566 544.1491 2.7811 4.8719 0.9792 5.1842 2.8619 21.1015 29.2320 133.0879 239.8099 3.0452 123.5144 1.0198 281.4719 11.1177 4.4868 14.5122 8.5128 7.8235 9.9300 4.1459 15.1542 19.9530 9.6265 5.4590 9.9707 1.6934 94.8938 1.0169 17.3372 22.5928 4.0393 12.2491 10.9729 39.9277 13.9383 44.0262 20.1562 4.3957 47.8948 112.9955 178.3940 19.5399 33.6274 35.7841 8.9535 21.6147 15.0696 14.3033 14.7676 29.2056 24.1180 26.8388 3.4614 21.3960 0.3110 10.5035 32.9305 6.2059 38.9848 1.4396
temp: 298.150 k
press: 1.00000 atm
elementType: 8 8 6 6 6 6 6 6 6 6 6 6 6 6 6 6 6 6 6 6 6 6 1 1 1 1 1 1 1 1 1 1 1 1 1 1 1 1 1 1
symmnumber: 1
zpe: 836852.0 jmol-1
zpe.correction: 0.318740 hartree
zpe.thermalcorrener: 0.338708 hartree
zpe.thermalcorrenthalpy: 0.339652 hartree
zpe.thermalcorrgfe: 0.268223 hartree
zpe.sumelectzpe: -921.864679 hartree
zpe.sumelectthermal: -921.844712 hartree
zpe.sumelectthermalent: -921.843768 hartree
zpe.sumelectthermalfe: -921.915196 hartree
dipole: 0.9019 -1.8096 -0.2106
dipole: 2.0328
quadrupole: -101.1765 -129.3045 -123.7548
quadrupole: -2.7952 -3.0304 2.1197
quadrupole: 16.9021 -11.2259 -5.6762 -2.7952 -3.0304 2.1197
hfenergy: -922.1834195 hartree
pointgroup: C01 [X(C20H18O2)]
dipole: 0.3790295 0.6927887 0.1266256 debye
polarizability: 388.0252755|-7.8152893|180.8848062|-0.5117356|15.5977272|161.8164174 unknown
InChI: InChI=1S/C20H18O2/c1-13-10-14(2)19(15(3)11-13)20(21)22-18-9-8-16-6-4-5-7-17(16)12-18/h4-12H,1-3H3
charge 0 multiplicity 1
40 atoms
O  0.188236 0.139944 -0.00033
O  0.782484 -2.04685 -0.599973
C  2.529753 -0.392521 -0.119172
C  2.933603 0.90589 -0.571468
C  3.483813 -1.282815 0.476639
C  5.240226 0.440388 0.207284
C  4.285723 1.286832 -0.404218
C  4.816477 -0.839707 0.636205
C  -3.457953 0.526541 0.616803
C  1.131537 -0.88548 -0.290652
C  -4.029489 -0.182921 -0.511396
C  1.996002 1.885322 -1.260598
C  3.117181 -2.676531 0.958121
C  -1.216824 -0.050952 -0.179292
C  -2.034121 0.576042 0.758868
C  6.672851 0.897869 0.409884
C  -3.146061 -0.807955 -1.452675
C  -1.76069 -0.750023 -1.302937
C  -4.337938 1.157742 1.558215
C  -5.455289 -0.234035 -0.65201
C  -5.723388 1.090043 1.394628
C  -6.287943 0.38877 0.280848
H  4.60093 2.273158 -0.766657
H  5.542502 -1.51558 1.104571
H  2.573427 2.704526 -1.722284
H  1.393958 1.403256 -2.050986
H  1.279086 2.323149 -0.544823
H  2.224462 -2.670309 1.609117
H  2.870396 -3.338521 0.110284
H  3.954452 -3.120101 1.523081
H  -1.578122 1.107156 1.600751
H  6.794915 1.384532 1.397358
H  7.378826 0.049724 0.373818
H  6.976304 1.631989 -0.356824
H  -3.575315 -1.342988 -2.307789
H  -1.097437 -1.240457 -2.017567
H  -3.906629 1.694058 2.411849
H  -5.884534 -0.77186 -1.505866
H  -6.386537 1.573928 2.120136
H  -7.376377 0.343851 0.165457
