program: Gaussian 09
title: 000291914
version: EM64L-G09RevD.01
frameworkgroup: C1[X(C10H11ClO2)]
method: RPBEPBE
basis: SDD
operation: Freq
keyword: #p
keyword: freq=noraman
keyword: PBEPBE/SDD
title: #p freq=noraman PBEPBE/SDD
converged: YES YES NO NO
title: Mulliken charges:
elementType: Cl O O C C C C C C C C C C H H H H H H H H H H H
charge: -0.064180 -0.411665 -0.240634 -0.222992 0.521579 -0.492155 -0.724901 -0.415971 -0.384801 0.196565 -0.211700 -0.226001 -0.107904 0.247852 0.247541 0.254416 0.216805 0.208181 0.236627 0.256870 0.230712 0.255073 0.252169 0.378512
chargesum: 0.00000
title: Mulliken charges with hydrogens summed into heavy atoms:
elementType: Cl O O C C C C C C C C C C
charge: -0.064180 -0.033153 -0.240634 0.024860 0.521579 0.009802 -0.063288 -0.159101 -0.154089 0.196565 0.043372 0.026168 -0.107904
polarizability: 1.52706307e+02 1.72812408e+01 1.00154625e+02 4.52581685e+00 -1.28045474e+01 1.02583685e+02
1716.lowfreq: -16.1246 -0.5374 -0.0029 0.0010 0.0013 6.9392 26.8959 30.7260 44.9718
frequency: 26.3317 30.7154 44.9570 89.6676 145.3793 165.5518 211.3453 234.6882 253.7945 303.9361 337.6419 373.4493 408.0740 428.2815 482.7788 512.7310 539.0118 586.2303 615.2472 627.7374 659.7428 722.4458 756.6098 827.4282 832.8213 850.9733 903.4531 934.4327 950.6769 966.7745 998.9549 1023.3375 1046.6422 1073.5535 1078.0166 1110.9866 1123.5666 1178.7496 1185.6169 1212.7965 1251.3069 1289.3697 1294.5974 1326.2075 1358.1038 1381.1804 1394.5615 1404.5678 1435.1323 1473.5137 1476.9305 1483.0677 1586.6075 1599.6347 1662.0529 2979.1181 2986.3996 3010.9502 3066.9866 3073.4650 3087.6267 3128.1752 3142.2478 3166.6882 3171.4389 3506.6376
redmass: 3.8772 7.9745 12.0120 4.7640 3.5983 4.4597 3.9911 1.1290 3.6507 4.4869 5.0015 4.5396 2.8753 3.9902 3.7880 2.0988 2.7340 3.9465 2.7915 6.3125 1.6558 3.2895 4.4868 1.3501 1.4183 3.1043 1.9304 2.0633 1.3820 1.3793 4.3354 1.8057 2.0950 2.6261 2.2884 1.9251 1.6751 1.3336 1.1234 1.9157 1.4499 1.3700 1.4288 1.9718 1.7732 5.0893 1.2280 2.0771 1.0960 1.5032 1.1051 1.3440 7.1705 6.2404 8.3880 1.0366 1.0645 1.0846 1.0979 1.0962 1.0997 1.0890 1.0897 1.0952 1.0964 1.0639
irintensity: 0.2796 0.8812 1.7655 0.1151 2.1565 0.3426 0.3906 0.1974 1.1730 0.8273 4.5381 4.9728 0.1392 3.6847 13.2551 21.6481 65.0280 12.6173 3.8024 0.0855 145.5594 6.6283 7.2210 15.8909 34.6881 3.4475 25.1774 10.0616 0.1126 0.7608 46.5980 42.3222 136.6450 40.4297 61.8884 16.5153 38.9909 0.4452 0.1405 3.9828 1.9103 5.3061 18.9901 6.0444 50.8857 0.5335 7.5338 8.1742 22.6599 30.4760 13.1249 56.8843 0.7240 7.6855 177.8306 26.9781 19.8774 3.7807 9.5599 46.1603 29.2859 12.5366 5.0515 6.7568 0.9591 21.9096
temp: 298.150 k
press: 1.00000 atm
elementType: 17 8 8 6 6 6 6 6 6 6 6 6 6 1 1 1 1 1 1 1 1 1 1 1
symmnumber: 1
zpe: 488026.7 jmol-1
zpe.correction: 0.185880 hartree
zpe.thermalcorrener: 0.198782 hartree
zpe.thermalcorrenthalpy: 0.199726 hartree
zpe.thermalcorrgfe: 0.144217 hartree
zpe.sumelectzpe: -997.222571 hartree
zpe.sumelectthermal: -997.209669 hartree
zpe.sumelectthermalent: -997.208725 hartree
zpe.sumelectthermalfe: -997.264234 hartree
dipole: 2.6287 1.2258 -0.9305
dipole: 3.0460
quadrupole: -87.8787 -78.3215 -83.1857
quadrupole: 0.7740 -2.4388 -0.5034
quadrupole: -4.7501 4.8072 -0.0571 0.7740 -2.4388 -0.5034
hfenergy: -997.4084508 hartree
pointgroup: C01 [X(C10H11Cl1O2)]
dipole: -1.0457524 -0.3212132 -0.4892708 debye
dipolederiv: -0.7958968 -0.2689496 0.0065596 -0.2915469 -0.1866793 0.0035523 0.0113012 0.0042766 -0.1327624 -0.5491058 0.2405908 -0.0968352 0.4284378 -1.0690454 0.3060736 -0.0898081 0.2531609 -0.324534 -0.4396301 0.1171339 -0.0032016 0.1847492 -0.5949874 -0.0879927 -0.1225076 0.1794831 -0.8795096 0.1883583 -0.0162832 -0.0303683 0.0239903 0.2036122 0.0126759 -0.0744199 -0.0767883 0.0598898 0.2448946 0.0956973 0.0105556 0.0998977 -0.1074736 -0.0229608 0.0244405 -0.0013634 -0.0876731 0.0301671 -0.0076563 -0.0749441 0.0210618 -0.2063132 -0.1552001 0.0090579 -0.1765863 -0.0995623 -0.0469211 -0.0118191 -0.010249 0.0205225 -0.0141303 -0.0704897 0.0193646 -0.0211532 0.0680291 -0.0434968 0.0314571 -0.056107 0.0156642 -0.1221765 0.0089381 -0.0303955 0.0011036 0.0650966 -0.0632564 0.0427563 0.0239994 0.0401626 -0.1210104 0.0113632 0.0202758 0.0185335 0.0642791 0.4131505 -0.3362654 0.160059 -0.643899 1.3690236 -0.0414539 0.1698864 -0.1828509 1.0930152 -0.2854462 -0.0706151 0.0682148 -0.0631236 -0.123681 0.0327296 0.0742191 0.0202846 0.0110259 -0.2887536 -0.0586643 -0.0469993 -0.0703684 -0.1335027 -0.0228904 -0.0690057 -0.0296226 0.0112648 1.0891389 0.4492684 -0.0141204 0.4691154 0.1112503 -0.0097662 -0.005975 -0.0081885 0.1065762 0.0313356 -0.0060387 -0.0026794 -0.028603 0.0468922 0.012527 0.0321733 0.0679898 -0.0883582 -0.1402281 -0.0476124 -0.0049631 -0.0450832 0.0635915 -0.0252967 0.0039409 -0.0177092 0.089067 0.1067513 0.0139356 0.0774967 0.0008874 0.0327571 0.0448756 0.0340792 0.0609092 -0.0331139 -0.1702674 -0.1366622 0.0076877 -0.1121303 0.0315319 -0.0114421 0.0173538 -0.011041 0.0789173 0.1052427 -0.0043784 0.0414494 -0.0032728 0.0473017 0.0997603 0.0256476 0.0220814 -0.1310165 0.0068846 0.1454177 -0.0240222 0.1211671 -0.048928 0.0035527 -0.0295263 0.0318459 0.0660429 0.0551645 -0.0511478 0.0847067 -0.0522317 0.1257488 0.0207636 0.0685487 0.0192995 -0.0059236 0.0363889 -0.0422287 -0.0961759 -0.036865 0.1229422 -0.0365092 -0.0980765 -0.0375925 -0.0362852 0.0592963 -0.0390423 -0.0651521 -0.0445838 0.1471046 -0.0250134 -0.0653862 -0.0222773 -0.0040283 0.0611715 -0.0399102 0.0621385 -0.0428891 0.1457101 0.0279473 0.0628575 0.0267735 -0.0119256 0.3950576 0.0010166 -0.0170499 0.0089407 0.2804617 -0.075744 0.0119542 -0.1205684 0.1214889 unknown
polarizability: 149.6838021|22.7226457|93.074209|1.8238642|4.1308988|112.6866062 unknown
InChI: InChI=1S/C10H11ClO2/c1-7(6-10(12)13)8-2-4-9(11)5-3-8/h2-5,7,12H,6H2,1H3
charge 0 multiplicity 1
24 atoms
Cl 4.423474 1.021426 -0.140265
O  -2.920206 2.073835 0.131066
O  -2.263861 0.718151 1.89595
C  -1.307971 -1.303217 -0.037632
C  0.116374 -0.739304 -0.073712
C  -2.352337 -0.208817 -0.400235
C  -1.486123 -2.534472 -0.959723
C  0.80971 -0.46804 1.13298
C  0.767889 -0.452151 -1.302076
C  -2.48024 0.857661 0.671577
C  2.118426 0.066707 1.125404
C  2.074258 0.083337 -1.332842
C  2.731116 0.333189 -0.112526
H  -1.519782 -1.615284 1.002583
H  -3.352338 -0.67607 -0.511649
H  -2.11939 0.275365 -1.364282
H  -2.494432 -2.971395 -0.836019
H  -1.366135 -2.270393 -2.026781
H  -0.741718 -3.313822 -0.720536
H  0.316371 -0.662731 2.091591
H  0.262274 -0.650599 -2.254437
H  2.644879 0.273037 2.061714
H  2.570797 0.299713 -2.283288
H  -3.020638 2.741075 0.864137
