program: Gaussian 09
title: 000291910
version: EM64L-G09RevD.01
frameworkgroup: C1[X(C10H16O2)]
method: RPBEPBE
basis: SDD
operation: Freq
keyword: #pfreq=noraman
keyword: PBEPBE/SDD
title: #p freq=noraman PBEPBE/SDD
converged: YES YES NO NO
title: Mulliken charges:
elementType: O O C C C C C C C C C C H H H H H H H H H H H H H H H H
charge: -0.300108 -0.299693 -0.081257 -0.081013 -0.422532 -0.384773 -0.021384 -0.414067 -0.506224 -0.371108 -0.027933 -0.579889 0.221340 0.237290 0.216049 0.214656 0.196989 0.217432 0.230349 0.217242 0.210805 0.217155 0.220329 0.217965 0.214420 0.219651 0.217403 0.220906
chargesum: 0.00000
title: Mulliken charges with hydrogens summed into heavy atoms:
elementType: O O C C C C C C C C C C
charge: -0.300108 -0.299693 0.140083 0.156277 0.008173 0.029648 0.208965 0.013980 -0.068740 0.061277 0.191718 -0.141580
polarizability: 1.23619341e+02 6.05315310e+00 1.20689228e+02 -6.75120521e+00 -8.00609700e+00 8.72689948e+01
1716.lowfreq: -14.1860 -1.7083 0.0004 0.0007 0.0008 5.0211 21.3348 26.2816 51.8479
frequency: 20.4627 26.0902 51.8458 70.7560 76.7349 96.6570 117.8568 141.2145 234.8416 247.6609 272.3827 350.3771 362.2268 398.0820 439.1120 476.4499 496.6937 630.9498 732.5840 737.4279 747.1123 772.2162 793.6136 847.9852 890.8558 904.1755 933.1845 950.4273 970.5448 985.6598 1005.4739 1008.6050 1027.9554 1037.7910 1059.0363 1074.8586 1097.8589 1099.2958 1119.2426 1136.1833 1156.4239 1182.8361 1208.6133 1226.3253 1233.8433 1250.5963 1253.5544 1280.6064 1291.6417 1296.9341 1313.2461 1329.8438 1353.6394 1396.1816 1424.5783 1439.8052 1462.5891 1463.1152 1465.2778 1479.1942 1483.5080 1657.4442 2963.6541 2982.8381 2983.8522 2986.8006 3008.4025 3037.4354 3045.3567 3049.3501 3058.0854 3063.0184 3075.9181 3078.1943 3082.0835 3094.0290 3163.5536 3196.7136
redmass: 2.7202 4.1816 4.2686 2.9666 2.6492 3.0989 1.9607 3.0995 3.0638 4.5205 2.5267 3.4467 2.8107 2.3730 2.9731 4.4652 2.1103 1.6653 1.6755 2.6996 5.2632 2.5796 3.0760 1.3435 1.9884 1.5272 2.1340 1.3615 1.7024 1.4953 1.1544 1.7534 1.3210 1.9861 2.4005 1.4524 2.9970 1.3019 1.3172 1.6837 2.2622 1.5530 1.3808 1.3477 1.4188 1.3285 1.2596 1.2950 1.1277 1.2269 1.3263 1.2833 1.5358 1.9856 1.2250 2.7922 1.1045 1.1111 1.0832 1.1806 1.1144 4.6981 1.0592 1.0604 1.0609 1.0606 1.0981 1.0991 1.0969 1.0975 1.0538 1.0954 1.0929 1.0765 1.0883 1.0796 1.1187 1.1146
irintensity: 0.9094 1.9057 4.0240 0.9408 0.7524 0.5111 0.8971 5.8748 3.4336 1.0380 2.5686 0.9492 0.5340 2.1282 9.9861 28.0048 3.1915 20.3046 3.0619 5.6799 4.0934 33.8715 43.6925 3.4842 13.4708 1.5572 6.6511 79.4915 18.3721 1.5331 16.6299 0.4463 5.2273 7.5903 0.8315 1.0350 11.8115 5.0587 6.7319 4.9074 3.1701 6.7454 2.1676 6.5360 2.2555 0.4494 0.2374 2.5084 0.2059 0.9263 5.8581 9.1666 0.1808 12.7314 5.2241 7.2306 19.1513 2.2195 1.5431 5.7284 18.6716 14.7110 14.8006 2.7267 17.8265 62.3630 4.9729 1.5561 9.8440 22.7970 33.6441 36.3326 39.0052 20.8795 61.0421 6.5483 35.6181 25.6637
temp: 298.150 k
press: 1.00000 atm
elementType: 8 8 6 6 6 6 6 6 6 6 6 6 1 1 1 1 1 1 1 1 1 1 1 1 1 1 1 1
symmnumber: 1
zpe: 621828.2 jmol-1
zpe.correction: 0.236842 hartree
zpe.thermalcorrener: 0.250645 hartree
zpe.thermalcorrenthalpy: 0.251589 hartree
zpe.thermalcorrgfe: 0.193173 hartree
zpe.sumelectzpe: -540.038553 hartree
zpe.sumelectthermal: -540.024750 hartree
zpe.sumelectthermalent: -540.023806 hartree
zpe.sumelectthermalfe: -540.082222 hartree
dipole: 1.2110 2.6314 0.9799
dipole: 3.0580
quadrupole: -96.5008 -76.1859 -70.0423
quadrupole: 4.3835 -2.7586 -2.8503
quadrupole: -15.5911 4.7237 10.8674 4.3835 -2.7586 -2.8503
hfenergy: -540.275395 hartree
pointgroup: C01 [X(C10H16O2)]
dipole: -0.5102135 1.0220074 -0.3776402 debye
polarizability: 123.7658818|-5.8496312|120.3341304|-7.4591457|7.931272|87.4775513 unknown
InChI: InChI=1S/C10H16O2/c1-2-4-9-10(12-9)6-3-5-8-7-11-8/h2,8-10H,1,3-7H2
charge 0 multiplicity 1
28 atoms
O  -2.292026 -2.225778 0.326785
O  4.856529 0.565791 0.087638
C  -1.244023 -1.396251 -0.390725
C  -2.268794 -0.716818 0.468897
C  0.193536 -1.586935 0.053382
C  1.105911 -0.433321 -0.430528
C  3.480714 0.465554 -0.537486
C  2.58463 -0.645418 -0.024535
C  -3.456779 0.034491 -0.119668
C  3.833102 1.654504 0.304962
C  -3.117596 1.490748 -0.382048
C  -3.737891 2.551059 0.193309
H  -1.408542 -1.364974 -1.479809
H  -1.945634 -0.387085 1.467482
H  0.573151 -2.551536 -0.33897
H  0.224646 -1.659739 1.157528
H  1.035127 -0.344324 -1.534645
H  0.740795 0.526824 -0.013483
H  3.50261 0.594882 -1.63017
H  2.945492 -1.615069 -0.421589
H  2.672329 -0.701885 1.077592
H  -3.745684 -0.469433 -1.0636
H  -4.320719 -0.039565 0.566879
H  4.06975 2.614076 -0.171607
H  3.44103 1.715159 1.328999
H  -2.297759 1.670961 -1.095231
H  -3.448507 3.582425 -0.038185
H  -4.558302 2.416657 0.909426
