program: Gaussian 09
title: 000291925
version: EM64L-G09RevD.01
frameworkgroup: C1[X(C16H15NS)]
method: RPBEPBE
basis: SDD
operation: Freq
keyword: #p
keyword: freq=noraman
keyword: PBEPBE/SDD
title: #p freq=noraman PBEPBE/SDD
converged: YES YES NO NO
title: Mulliken charges:
elementType: S N C C C C C C C C C C C C C C C C H H H H H H H H H H H H H H H
charge: 0.207687 -0.071443 0.485744 0.241929 -0.223126 -0.394195 -0.327383 -0.136947 -0.221914 -0.378275 -0.392915 -0.303909 -0.235496 -0.234309 -0.220961 -0.238947 -0.276312 -0.863530 0.254618 0.237314 0.238693 0.238913 0.230367 0.228784 0.216117 0.228078 0.228669 0.250660 0.231395 0.205284 0.266800 0.266519 0.262091
chargesum: 0.00000
title: Mulliken charges with hydrogens summed into heavy atoms:
elementType: S N C C C C C C C C C C C C C C C C
charge: 0.207687 -0.071443 0.485744 0.241929 -0.223126 -0.139577 -0.090069 0.101746 0.016999 -0.147907 -0.164131 -0.087792 -0.007418 -0.005640 0.029699 -0.007552 -0.071028 -0.068120
polarizability: 6.20738892e+02 -1.23879505e+01 1.77101161e+02 1.73003846e-01 -2.45918875e+00 8.56912785e+01
1716.lowfreq: -7.8884 -2.3880 -0.0015 0.0008 0.0011 1.9102 21.3518 27.6384 33.2315
frequency: 21.0726 27.5708 33.1948 43.7295 71.4121 103.8740 126.8904 155.5668 183.0239 208.0508 228.6754 236.7615 280.4573 320.9982 336.1734 376.8810 383.2956 402.9918 411.6105 478.7036 504.9795 509.0466 527.7335 613.4332 614.9707 629.5949 653.2887 677.5023 693.9474 718.6133 767.8875 803.9629 818.7436 830.8093 844.8398 851.7314 880.0822 926.9951 945.1667 953.9237 961.7707 965.1134 978.5393 986.6081 987.4930 991.2200 998.3165 1002.9607 1025.6386 1072.7815 1081.9531 1119.4497 1152.7309 1173.2915 1182.9155 1190.8677 1212.9494 1232.7198 1267.7269 1291.1232 1297.5940 1327.3829 1341.4529 1349.4378 1364.3079 1389.3290 1415.5058 1440.7471 1453.5948 1462.2143 1473.8668 1483.5600 1549.4216 1559.0414 1579.2814 1602.9274 1609.8937 1633.4231 2942.3061 3007.9049 3079.2959 3118.5499 3124.7634 3125.0961 3127.8019 3135.0257 3135.3776 3141.0532 3145.6541 3147.0624 3151.7774 3166.5320 3167.1196
redmass: 3.8467 4.9227 5.6931 3.6155 4.9985 5.0501 4.1384 3.9862 2.6203 1.5926 4.9061 1.8774 4.7896 3.2771 4.3034 7.0896 5.4786 2.7791 3.0133 4.3505 3.2634 4.0369 2.9235 5.4736 6.4046 6.5874 6.1588 7.4011 1.7074 3.5314 1.7207 4.7853 1.3208 1.5976 1.2923 5.0509 1.6065 1.5612 1.3518 1.5391 1.3802 1.1827 1.3923 1.5663 5.5967 1.2788 2.0698 1.2892 2.1851 3.5343 1.6689 1.3475 2.8377 1.0714 1.4030 1.1218 2.0210 1.4842 1.8021 1.5085 1.3647 1.4000 2.1140 1.3178 2.1125 5.0179 3.9713 2.3185 1.0528 1.1168 2.0255 2.3118 6.6681 5.4799 5.5762 6.3627 6.0667 5.3447 1.0861 1.0291 1.0893 1.0873 1.0868 1.1062 1.0863 1.1017 1.0903 1.0913 1.0876 1.0964 1.0957 1.1014 1.0967
irintensity: 1.9339 0.2985 0.1250 1.5652 0.4313 3.0165 2.8530 1.2952 12.3498 0.6382 1.6441 0.3246 4.5157 3.0521 2.9079 16.6564 11.1749 0.0035 6.2917 2.8189 12.9620 7.3834 6.6317 6.9850 0.0753 3.6946 8.6351 8.3799 45.3553 0.2816 70.4125 4.1437 11.8845 58.4517 0.7494 0.7342 0.4816 0.5776 2.2933 0.7097 4.9259 7.3556 0.0256 12.5791 0.8632 38.4604 12.5520 37.4747 5.4672 93.3446 11.5945 10.3799 9.3047 0.5926 19.7773 1.8522 1.3013 0.8160 1.9979 0.5090 1.7060 1.4639 2.3396 8.2840 0.2408 4.0142 2.0554 15.2932 15.7370 85.5037 67.9847 3.4764 12.5906 7.0525 2.4129 74.2723 7.0875 56.1935 58.4687 35.4989 19.1435 9.2882 10.2912 17.8232 5.4517 10.9173 22.3294 6.0083 6.7526 13.4605 37.2632 47.4804 9.8155
temp: 298.150 k
press: 1.00000 atm
elementType: 16 7 6 6 6 6 6 6 6 6 6 6 6 6 6 6 6 6 1 1 1 1 1 1 1 1 1 1 1 1 1 1 1
symmnumber: 1
zpe: 682605.1 jmol-1
zpe.correction: 0.259991 hartree
zpe.thermalcorrener: 0.276906 hartree
zpe.thermalcorrenthalpy: 0.277850 hartree
zpe.thermalcorrgfe: 0.212434 hartree
zpe.sumelectzpe: -1070.225162 hartree
zpe.sumelectthermal: -1070.208247 hartree
zpe.sumelectthermalent: -1070.207302 hartree
zpe.sumelectthermalfe: -1070.272718 hartree
dipole: 0.5126 -0.0867 0.6720
dipole: 0.8496
quadrupole: -83.8202 -103.1492 -121.0136
quadrupole: -10.7231 -3.4015 -0.2357
quadrupole: 18.8408 -0.4882 -18.3526 -10.7231 -3.4015 -0.2357
hfenergy: -1070.4851525 hartree
pointgroup: C01 [X(C16H15N1S1)]
dipole: -0.2163617 0.2506954 0.0454772 debye
polarizability: 619.6050523|27.7165772|95.6229783|4.2122806|-26.3778943|168.3033013 unknown
InChI: InChI=1S/C16H15NS/c1-18-16-11-9-15(10-12-16)17-13-5-8-14-6-3-2-4-7-14/h2-13H,1H3
charge 0 multiplicity 1
33 atoms
S  6.629975 0.765863 -1.005899
N  0.783977 -0.074116 0.524347
C  -4.103226 0.130325 -0.259058
C  2.125449 0.141828 0.122492
C  4.890533 0.520687 -0.489568
C  3.104488 0.197652 1.151423
C  2.567543 0.248442 -1.232889
C  4.466566 0.399828 0.856713
C  3.928147 0.430538 -1.531795
C  -4.531042 -0.593499 0.894659
C  -5.102107 0.627055 -1.147618
C  -2.691298 0.383626 -0.568352
C  -5.90006 -0.806271 1.144178
C  -6.473144 0.414114 -0.897054
C  -1.596113 0.004829 0.174495
C  -6.879621 -0.304291 0.251359
C  -0.23489 0.302596 -0.225705
C  7.538424 0.821388 0.634482
H  2.766282 0.088455 2.186794
H  1.850381 0.151746 -2.056237
H  5.184613 0.451189 1.680644
H  4.251072 0.4929 -2.577509
H  -3.789195 -0.991115 1.595619
H  -4.791356 1.185541 -2.039602
H  -2.503751 0.940564 -1.500004
H  -6.20983 -1.364716 2.034644
H  -7.2230 0.805919 -1.593173
H  -1.698501 -0.550199 1.114823
H  -7.943841 -0.472604 0.449649
H  -0.108783 0.877952 -1.168647
H  7.429796 -0.132672 1.173424
H  7.18123 1.662475 1.248941
H  8.596682 0.978867 0.375524
