program: Gaussian 09
title: 000291921
version: EM64L-G09RevD.01
frameworkgroup: C1[X(C13H10N4O6)]
method: RPBEPBE
basis: SDD
operation: Freq
keyword: #p
keyword: freq=noraman
keyword: PBEPBE/SDD
title: #p freq=noraman PBEPBE/SDD
converged: YES YES NO NO
title: Mulliken charges:
elementType: O O O O O O N N N N C C C C C C C C C C C C C H H H H H H H H H H
charge: -0.185905 -0.174357 -0.170355 -0.248146 -0.195681 -0.194429 -0.432042 0.006157 0.024073 0.014726 0.189931 0.364782 0.277905 0.421054 -0.549036 -0.560694 0.491889 -0.406890 -0.328532 0.446422 -0.354887 -0.365088 -0.801688 0.357281 0.333933 0.343415 0.251527 0.255725 0.240166 0.241902 0.233619 0.231617 0.241608
chargesum: 0.00000
title: Mulliken charges with hydrogens summed into heavy atoms:
elementType: O O O O O O N N N N C C C C C C C C C C C C C
charge: -0.185905 -0.174357 -0.170355 -0.248146 -0.195681 -0.194429 -0.074761 0.006157 0.024073 0.014726 0.189931 0.364782 0.277905 0.421054 -0.215103 -0.217280 0.491889 -0.155363 -0.072807 0.446422 -0.114721 -0.123186 -0.094844
polarizability: 4.01676435e+02 2.67323217e+00 2.30369366e+02 -1.36523856e+01 1.48636556e+01 1.09218458e+02
1716.lowfreq: -24.5521 -6.0500 -3.7873 0.0006 0.0007 0.0009 5.6201 28.8251 29.7581
frequency: -24.2258 28.8151 29.7312 44.0625 59.2427 66.6424 77.1666 100.2869 126.1775 146.2688 153.4634 178.5576 198.2384 209.0467 256.5895 299.2659 320.2674 328.0667 333.8680 366.7602 375.6761 403.9813 407.3655 443.2406 485.3490 497.8586 511.2381 526.1044 560.7715 625.8692 632.3515 647.1478 672.6903 675.7913 697.1451 699.8992 705.8859 734.4770 737.9894 767.3330 794.1580 819.6898 832.4073 836.4991 859.5815 892.3984 906.0080 952.3477 965.1602 971.9630 976.8131 989.1260 1007.7927 1047.3934 1070.9912 1127.9427 1131.3209 1159.6457 1161.1494 1189.6083 1194.2127 1218.5126 1225.8113 1234.0912 1297.2518 1316.9658 1343.2175 1350.8884 1369.5229 1375.3892 1382.2251 1399.2690 1418.3151 1442.4225 1468.9137 1472.9606 1488.0102 1503.6017 1529.0596 1575.8851 1594.5585 1610.5841 1623.5845 2978.2692 3060.7318 3092.1481 3130.0729 3132.9186 3150.5500 3156.8978 3182.4814 3184.5937 3188.5156
redmass: 1.0174 8.6426 4.8990 6.1102 15.0886 7.6396 8.8102 10.5233 7.8962 8.4851 6.7347 10.3366 5.5618 7.4452 5.2434 8.2947 12.5132 4.6271 4.9654 6.8366 10.4260 3.0513 4.3718 5.7918 4.8600 5.1966 4.4483 5.1075 5.1864 7.6191 7.1566 8.4307 10.4467 9.0533 7.0387 6.2442 3.6199 7.6810 13.4725 4.3310 3.2587 1.5642 1.2634 1.8616 5.4124 3.8252 7.4877 1.3281 1.4839 1.3789 1.3924 1.4018 2.8413 1.5731 1.7166 1.3070 7.4019 2.6066 3.6751 1.2334 6.1629 4.7090 2.9587 4.4720 1.7762 1.6558 4.6847 4.5782 7.7301 10.1100 8.1471 1.2176 3.3934 7.9421 1.1152 1.0594 4.3387 2.6259 3.2887 5.5491 3.1644 7.5557 6.4477 1.0396 1.0941 1.1000 1.0878 1.0883 1.0969 1.0978 1.0922 1.0916 1.0789
irintensity: 0.5814 0.1329 0.4277 0.4133 0.0174 0.7954 0.2443 6.1725 5.5292 1.6001 0.1078 3.7508 0.8097 1.5798 0.1016 1.5869 0.2702 0.1524 0.7154 0.4048 0.5887 1.5297 0.0400 5.8896 27.4053 0.8854 16.8876 6.7371 0.1458 1.6694 10.5181 4.0394 21.6633 13.0203 6.8016 8.2974 1.4012 2.0245 3.6227 10.7058 12.6060 9.0167 7.8322 78.3956 18.4079 19.1635 8.7335 3.6311 18.3501 0.5666 16.6902 0.2631 5.3539 27.1168 53.4163 18.5407 95.6548 204.9318 188.3716 14.0425 389.2129 266.7812 19.8014 87.7925 53.1714 42.6140 101.6706 121.8386 26.6790 42.0500 38.3650 12.7075 5.1515 6.9868 14.3946 14.4043 55.8881 68.1035 27.5088 73.9107 51.6224 121.0860 245.1828 26.8175 18.3600 14.1384 7.8228 18.5764 11.4991 5.2143 14.7047 20.8042 145.7122
temp: 298.150 k
press: 1.00000 atm
elementType: 8 8 8 8 8 8 7 7 7 7 6 6 6 6 6 6 6 6 6 6 6 6 6 1 1 1 1 1 1 1 1 1 1
symmnumber: 1
zpe: 589251.2 jmol-1
zpe.correction: 0.224434 hartree
zpe.thermalcorrener: 0.243704 hartree
zpe.thermalcorrenthalpy: 0.244648 hartree
zpe.thermalcorrgfe: 0.174800 hartree
zpe.sumelectzpe: -1169.851309 hartree
zpe.sumelectthermal: -1169.832039 hartree
zpe.sumelectthermalent: -1169.831095 hartree
zpe.sumelectthermalfe: -1169.900943 hartree
dipole: -6.6385 1.0191 -0.8560
dipole: 6.7706
quadrupole: -135.7753 -154.4783 -130.1433
quadrupole: -0.0292 8.4014 5.9842
quadrupole: 4.3570 -14.3460 9.9890 -0.0292 8.4014 5.9842
hfenergy: -1170.0757433 hartree
pointgroup: C01 [X(C13H10N4O6)]
dipole: 2.6445651 -0.1770026 -0.2656656 debye
polarizability: 397.2021264|32.0449626|193.8548656|2.23796|-59.9848387|150.207268 unknown
InChI: InChI=1S/C13H10N4O6/c1-8-2-4-9(5-3-8)14-13-11(16(20)21)6-10(15(18)19)7-12(13)17(22)23/h2-7,14H,1H3
charge 0 multiplicity 1
33 atoms
O  -0.000944 2.782508 -1.062672
O  -2.219589 -3.528554 1.569958
O  0.959321 2.077567 0.888946
O  -0.043361 -2.965278 1.925701
O  -4.706526 1.451495 -1.277158
O  -5.369549 -0.567381 -0.428362
N  0.92532 -0.859506 0.738068
N  0.126306 1.947117 -0.086817
N  -1.242871 -2.700631 1.457206
N  -4.475176 0.330678 -0.6763
C  -0.370327 -0.490575 0.506956
C  -0.78595 0.778814 -0.056719
C  -1.466303 -1.412661 0.787749
C  2.135573 -0.33872 0.18393
C  -2.09534 1.036237 -0.466425
C  -2.791892 -1.142219 0.408386
C  -3.090287 0.059707 -0.248344
C  3.298653 -0.352183 0.992384
C  2.223531 0.07418 -1.16967
C  4.636568 0.505658 -0.891596
C  4.529763 0.069471 0.455331
C  3.461508 0.497808 -1.688665
C  5.970254 0.938111 -1.469708
H  0.99166 -1.718209 1.324787
H  -2.354793 2.000828 -0.911848
H  -3.577273 -1.874118 0.615494
H  3.228216 -0.663631 2.040247
H  1.343176 0.045436 -1.821252
H  5.420713 0.069135 1.09363
H  3.517551 0.821447 -2.734256
H  5.841209 1.680086 -2.276439
H  6.621569 1.381876 -0.69687
H  6.513891 0.074809 -1.900875
