program: Gaussian 09
title: 000291923
version: EM64L-G09RevD.01
frameworkgroup: C1[X(C13H10N4O6S)]
method: RPBEPBE
basis: SDD
operation: Freq
keyword: #p
keyword: freq=noraman
keyword: PBEPBE/SDD
title: #p freq=noraman PBEPBE/SDD
converged: YES YES NO NO
title: Mulliken charges:
elementType: S O O O O O O N N N N C C C C C C C C C C C C C H H H H H H H H H H
charge: 0.242621 -0.189974 -0.175997 -0.171572 -0.250412 -0.197110 -0.195434 -0.430603 0.002846 0.022777 0.014155 0.187999 0.365605 0.276908 0.434267 -0.550847 -0.561532 0.491724 -0.409608 -0.347032 -0.186419 -0.123817 -0.244551 -0.861747 0.356637 0.334030 0.343361 0.255095 0.257417 0.250787 0.247220 0.275410 0.267468 0.270327
chargesum: 0.00000
title: Mulliken charges with hydrogens summed into heavy atoms:
elementType: S O O O O O O N N N N C C C C C C C C C C C C C
charge: 0.242621 -0.189974 -0.175997 -0.171572 -0.250412 -0.197110 -0.195434 -0.073966 0.002846 0.022777 0.014155 0.187999 0.365605 0.276908 0.434267 -0.216817 -0.218171 0.491724 -0.154512 -0.089615 0.064368 0.123404 -0.244551 -0.048543
polarizability: 5.31200153e+02 9.95704286e+00 2.53841376e+02 -1.47985996e+01 1.50520279e+01 1.20284915e+02
1716.lowfreq: -4.4751 -2.6306 -0.0012 0.0004 0.0010 4.0579 23.5647 27.5229 31.5025
frequency: 23.5468 27.5189 31.4943 51.7937 59.8187 70.0670 75.5084 96.4677 118.4647 134.7750 147.3150 165.8907 183.7526 197.6495 200.7782 221.6250 265.5147 296.1993 318.9971 324.2126 332.9195 358.0463 375.0920 405.3344 407.2515 423.4671 445.9957 495.7407 506.7040 522.8439 544.8463 604.3044 620.8237 644.1311 661.6532 670.9981 674.5344 684.4403 698.3470 702.9380 710.5995 733.9709 739.3944 789.1525 817.1312 824.8089 839.9695 859.1920 893.5088 905.9296 949.6176 963.9189 964.9809 969.0554 977.2839 989.3978 1002.3626 1070.1820 1079.9091 1128.7813 1129.6677 1158.5692 1160.3562 1191.1725 1196.3632 1219.9914 1237.6785 1296.0944 1309.3133 1341.7942 1348.9620 1353.0383 1365.5602 1373.2549 1380.6617 1424.6970 1442.4927 1455.8185 1460.6792 1480.5640 1487.8600 1527.5303 1566.1207 1590.3287 1603.7249 1616.8928 3011.0223 3130.3760 3138.3907 3139.8695 3140.2176 3160.0293 3167.4255 3168.9476 3183.0336 3185.0673
redmass: 7.3346 9.3750 4.6282 6.0919 14.9608 7.9539 7.2268 9.5848 7.9359 6.5947 11.3983 9.8811 5.0404 5.0760 6.3529 1.2291 4.9032 9.0412 10.1281 7.3756 8.4437 7.6437 10.5180 3.2382 5.0229 8.5456 5.7958 4.1045 3.9685 6.8114 5.6294 6.4393 7.8585 9.1507 9.4203 9.1881 9.4479 7.3658 6.0120 6.1096 4.6860 8.7462 12.9532 4.1621 1.3638 1.4185 2.0672 4.3440 3.3321 7.2777 1.3478 1.3563 1.4821 1.1901 1.3913 1.5022 2.3940 1.7903 3.2843 5.2980 1.4982 7.6405 1.9013 4.4769 1.3728 6.8954 3.0118 1.6383 1.7789 5.2702 3.4104 1.2310 5.7449 10.8942 7.9779 3.9221 8.1323 1.0523 1.0873 2.7027 3.3481 3.4665 7.7776 2.8304 5.5132 6.9818 1.0292 1.1064 1.0982 1.0886 1.0927 1.0974 1.0800 1.0935 1.0922 1.0923
irintensity: 0.2874 0.0788 0.4375 3.4961 0.0277 0.6287 1.4822 4.4729 5.4617 1.0072 1.3350 1.1302 2.9599 0.8455 1.0277 0.5886 0.2083 2.4321 0.2109 0.6481 0.7416 2.1300 1.8168 6.4413 1.8746 29.5560 3.8755 4.3044 27.0525 3.9921 1.8139 5.8253 1.9260 1.1875 17.6794 9.8566 10.2864 9.1484 9.2893 4.5297 1.3089 1.7881 3.6926 9.2210 13.8579 10.8230 71.6570 25.7398 19.3654 8.6513 1.9754 1.7953 17.3291 7.2541 16.4229 12.2248 12.0770 88.0667 116.6863 130.4354 21.0494 412.5157 9.0179 248.3100 172.6017 398.8347 80.8902 52.8487 49.9392 132.2136 108.8381 16.4397 23.2879 31.3959 50.3503 10.5632 7.3795 17.7711 56.3061 16.7291 71.6395 20.4509 47.2442 25.0659 79.7460 429.5311 22.0672 13.6372 9.3295 3.0757 0.9830 5.4130 107.8252 9.5863 23.4492 28.9885
temp: 298.150 k
press: 1.00000 atm
elementType: 16 8 8 8 8 8 8 7 7 7 7 6 6 6 6 6 6 6 6 6 6 6 6 6 1 1 1 1 1 1 1 1 1 1
symmnumber: 1
zpe: 593015.9 jmol-1
zpe.correction: 0.225868 hartree
zpe.thermalcorrener: 0.247491 hartree
zpe.thermalcorrenthalpy: 0.248435 hartree
zpe.thermalcorrgfe: 0.172588 hartree
zpe.sumelectzpe: -1567.825745 hartree
zpe.sumelectthermal: -1567.804122 hartree
zpe.sumelectthermalent: -1567.803178 hartree
zpe.sumelectthermalfe: -1567.879025 hartree
dipole: -6.5371 0.2934 -1.4738
dipole: 6.7076
quadrupole: -159.3428 -163.6644 -144.1352
quadrupole: 8.1699 14.6308 10.0348
quadrupole: -3.6287 -7.9502 11.5789 8.1699 14.6308 10.0348
hfenergy: -1568.0516129 hartree
pointgroup: C01 [X(C13H10N4O6S1)]
dipole: -2.5863176 -0.0199982 -0.5242081 debye
polarizability: 522.606437|52.8152035|235.320006|-13.8120981|54.7116251|147.4000013 unknown
InChI: InChI=1S/C13H10N4O6S/c1-24-10-4-2-8(3-5-10)14-13-11(16(20)21)6-9(15(18)19)7-12(13)17(22)23/h2-7,14H,1H3
charge 0 multiplicity 1
34 atoms
S  -6.257779 -0.822153 -0.240138
O  -0.014458 -2.940923 -0.165634
O  2.72592 3.651381 0.694173
O  -0.723959 -1.751714 1.654283
O  0.599814 3.311198 1.433862
O  4.668941 -1.982725 -1.198562
O  5.501645 0.129254 -0.911079
N  -0.58602 1.067076 0.860295
N  0.002849 -1.899568 0.59892
N  1.718457 2.877773 0.893641
N  4.552294 -0.74422 -0.846413
C  0.656289 0.571494 0.571453
C  0.95312 -0.813918 0.264468
C  1.81065 1.463402 0.511376
C  -1.875703 0.531464 0.579693
C  2.192929 -1.236342 -0.219499
C  3.068294 1.03412 0.055798
C  3.241163 -0.299747 -0.340404
C  -2.937039 0.853819 1.466298
C  -2.155284 -0.195457 -0.605044
C  -4.245143 0.430103 1.187107
C  -3.466767 -0.622697 -0.881243
C  -4.52434 -0.320713 0.012385
C  -6.175262 -1.812757 -1.831857
H  -0.538298 2.033608 1.250173
H  2.36144 -2.289782 -0.460085
H  3.898684 1.743417 0.002407
H  -2.729278 1.414488 2.383897
H  -1.363329 -0.409873 -1.330742
H  -5.052266 0.673276 1.886235
H  -3.650139 -1.181426 -1.803215
H  -5.512048 -2.683313 -1.713067
H  -5.851534 -1.178161 -2.671202
H  -7.205146 -2.157682 -2.009483
