program: Gaussian 09
title: 000291932
version: EM64L-G09RevD.01
frameworkgroup: C1[X(C17H15N3O3)]
method: RPBEPBE
basis: SDD
operation: Freq
keyword: #p
keyword: freq=noraman
keyword: PBEPBE/SDD
title: #p freq=noraman PBEPBE/SDD
converged: YES YES NO NO
title: Mulliken charges:
elementType: O O O N N N C C C C C C C C C C C C C C C C C H H H H H H H H H H H H H H H
charge: -0.216144 -0.204990 -0.200867 0.059337 -0.409190 0.027011 -0.445519 -0.551597 -0.546424 0.310563 0.296664 -0.564827 -0.427106 0.481173 -0.401822 -0.396799 0.284108 0.173199 -0.337408 -0.333342 0.390201 -0.364916 -0.351008 0.220569 0.226848 0.234632 0.229605 0.229042 0.230702 0.292193 0.242809 0.222189 0.205459 0.289175 0.240502 0.285185 0.289437 0.291354
chargesum: 0.00000
title: Mulliken charges with hydrogens summed into heavy atoms:
elementType: O O O N N N C C C C C C C C C C C C C C C C C
charge: -0.216144 -0.204990 -0.200867 0.059337 -0.120015 0.027011 0.001899 -0.087360 -0.086680 0.310563 0.296664 -0.272634 -0.184296 0.481173 -0.179633 -0.191340 0.284108 0.173199 -0.096906 -0.048157 0.390201 -0.075479 -0.059655
polarizability: 5.17988601e+02 -1.52441884e+01 2.16069392e+02 -4.05434996e+00 4.87169826e+00 1.04319829e+02
1716.lowfreq: -4.9898 -2.5962 -0.0009 -0.0004 0.0009 5.3483 15.9195 25.0105 29.5665
frequency: 15.8057 24.9572 29.5601 53.4553 65.7971 76.4230 85.3983 121.6369 150.3281 171.3807 193.0428 201.4119 214.8557 239.1995 260.5046 295.0368 311.6880 357.0875 363.8081 408.8901 420.2350 431.1695 455.1291 483.5648 496.5033 518.6678 550.7471 563.8677 610.6144 617.2262 621.8407 631.7762 658.3739 683.6542 689.3567 714.7189 743.9376 761.7823 782.1050 792.2098 825.9155 849.8349 850.7906 870.9431 880.7731 882.6403 911.2199 930.3256 940.1087 954.0173 963.8870 985.9343 1002.1516 1007.3233 1017.7842 1024.7110 1049.3358 1091.2104 1094.0601 1109.3155 1119.4965 1128.7979 1156.7917 1165.9202 1181.8231 1200.8173 1214.8002 1217.6326 1237.3070 1251.3723 1262.5183 1284.2499 1292.7385 1296.2699 1315.8430 1341.1293 1364.5829 1388.2879 1400.8718 1409.6709 1440.6610 1455.9942 1458.8030 1473.3670 1479.8032 1485.1047 1510.2399 1563.5344 1585.5108 1590.2884 1606.8529 1617.5947 1623.7785 2955.2650 2970.8754 2977.1088 3007.1196 3045.6666 3053.0992 3080.6978 3114.5012 3139.7604 3141.5946 3150.1434 3165.5758 3184.3899 3188.1985 3377.8677
redmass: 6.5710 6.3173 5.2782 5.5635 6.8663 6.1438 6.4294 4.8980 2.5624 6.7496 3.4420 5.2345 2.8533 4.5182 5.4466 5.1343 6.4589 4.8348 3.6612 2.9061 5.3477 2.8894 5.3118 5.1315 7.0846 5.5010 4.1704 2.9321 5.7472 2.4155 3.1592 1.6312 6.2297 4.6589 6.7610 2.7303 3.4637 4.7688 6.3977 5.6934 1.3881 2.2673 1.3252 3.8140 1.6532 1.7503 2.3427 1.3942 1.4740 2.9407 1.4701 1.3726 2.0535 1.8220 2.5619 4.6159 1.6875 3.2814 2.7745 1.5057 2.2974 1.3269 1.6306 1.2641 1.3517 1.5450 1.4513 5.0330 3.2644 1.8792 1.2533 2.0852 1.3484 1.2731 1.4384 1.8185 6.9270 4.0955 11.3823 3.8859 4.1558 1.1360 1.1539 2.2565 1.1096 2.3897 1.9631 6.8897 7.9652 5.9512 6.2395 8.1750 7.2260 1.0867 1.0660 1.0661 1.0647 1.0947 1.0944 1.1039 1.0876 1.0899 1.0962 1.0929 1.0899 1.0945 1.0964 1.0752
irintensity: 0.0123 0.0761 0.0982 0.7131 2.8732 3.6036 12.6766 0.1610 0.4651 9.1231 0.2016 4.5029 12.9615 1.8736 7.6478 1.0621 2.7873 1.0180 7.2809 0.0985 8.9023 4.2930 5.0237 1.1669 6.3189 6.2650 1.7870 0.9815 3.4679 17.7141 8.4000 57.2326 4.5388 40.3957 9.6850 9.4621 4.4299 2.2847 52.0728 16.7733 22.3526 5.0586 8.4373 23.5640 47.3517 4.7436 5.7344 3.4734 28.1340 10.2777 17.2120 3.0768 8.1309 0.5479 0.4184 21.9707 8.0470 31.9132 0.5610 92.1760 48.1863 6.1573 13.4095 21.6462 48.5785 2.5028 9.6110 570.5130 77.0945 66.0083 2.2839 5.5749 4.7648 4.0960 9.1533 11.7370 80.9300 25.9072 5.6084 51.1571 14.5673 17.2774 8.7448 20.4252 10.0761 61.6493 146.6987 78.3121 87.3422 81.7423 28.1910 131.4072 22.7218 60.5201 34.0685 25.6147 42.1582 35.4944 31.1036 53.2832 11.1149 12.5203 28.5218 0.8491 0.9333 1.3860 1.4934 27.9363
temp: 298.150 k
press: 1.00000 atm
elementType: 8 8 8 7 7 7 6 6 6 6 6 6 6 6 6 6 6 6 6 6 6 6 6 1 1 1 1 1 1 1 1 1 1 1 1 1 1 1
symmnumber: 1
zpe: 758338.8 jmol-1
zpe.correction: 0.288836 hartree
zpe.thermalcorrener: 0.308462 hartree
zpe.thermalcorrenthalpy: 0.309406 hartree
zpe.thermalcorrgfe: 0.237666 hartree
zpe.sumelectzpe: -1045.019182 hartree
zpe.sumelectthermal: -1044.999556 hartree
zpe.sumelectthermalent: -1044.998612 hartree
zpe.sumelectthermalfe: -1045.070352 hartree
dipole: -6.5139 3.4107 -0.5114
dipole: 7.3706
quadrupole: -157.2923 -128.9830 -134.3980
quadrupole: -5.2978 -1.3697 0.3880
quadrupole: -17.0679 11.2415 5.8264 -5.2978 -1.3697 0.3880
hfenergy: -1045.3080178 hartree
pointgroup: C01 [X(C17H15N3O3)]
dipole: -2.5648698 0.9703607 0.9427183 debye
polarizability: 517.5526924|0.3700961|145.1221883|-20.5091469|53.812759|175.7029419 unknown
InChI: InChI=1S/C17H15N3O3/c21-17(14-6-8-16(9-7-14)20(22)23)19-18-11-12-4-5-13-2-1-3-15(13)10-12/h4-11,19H,1-3H2
charge 0 multiplicity 1
38 atoms
O  1.057913 -1.443516 -1.594434
O  7.432072 0.823702 1.32158
O  7.856702 0.151004 -0.816885
N  -0.857926 -0.04935 -0.080006
N  0.506849 0.16421 0.031149
N  7.054839 0.386989 0.166222
C  -7.423262 -0.839153 -0.890802
C  -6.017234 -1.516274 -0.929931
C  -7.40031 0.065915 0.381759
C  -5.126326 -0.512004 -0.209532
C  -5.923839 0.397717 0.544993
C  -3.728326 -0.41665 -0.203509
C  -5.314397 1.410873 1.311489
C  -3.102625 0.610487 0.566363
C  -3.904957 1.514762 1.318037
C  -1.645457 0.758793 0.602218
C  2.862967 -0.303644 -0.442687
C  1.408462 -0.598131 -0.727881
C  3.337949 0.159473 0.81434
C  3.789462 -0.563044 -1.48651
C  5.604285 0.143272 -0.044926
C  4.712249 0.385909 1.021189
C  5.164279 -0.33584 -1.298986
H  -8.249036 -1.571078 -0.877769
H  -7.549091 -0.204669 -1.787725
H  -5.676274 -1.739476 -1.956259
H  -6.02914 -2.477796 -0.377254
H  -7.7641 -0.494281 1.267853
H  -8.03945 0.961757 0.283533
H  -3.096081 -1.102876 -0.776708
H  -5.920308 2.115716 1.892073
H  -3.419135 2.304756 1.905075
H  -1.245818 1.581322 1.232876
H  0.868728 0.931673 0.617947
H  2.649933 0.3028 1.655173
H  3.405369 -0.953411 -2.433768
H  5.103822 0.73247 1.980941
H  5.894108 -0.52081 -2.091238
