program: Gaussian 09
title: 000291934
version: EM64L-G09RevD.01
frameworkgroup: C1[X(C17H19NO)]
method: RPBEPBE
basis: SDD
operation: Freq
keyword: #p
keyword: freq=noraman
keyword: PBEPBE/SDD
title: #p freq=noraman PBEPBE/SDD
converged: YES YES NO NO
title: Mulliken charges:
elementType: O N C C C C C C C C C C C C C C C C C H H H H H H H H H H H H H H H H H H H
charge: -0.280662 -0.140653 -0.054944 -0.584199 -0.720834 0.518872 0.105464 -0.633595 -0.441093 -0.378557 0.275502 -0.226416 -0.240698 -0.376597 -0.336962 -0.243286 -0.223299 -0.243056 -0.232514 0.264541 0.211820 0.218237 0.229956 0.215128 0.245056 0.236181 0.269580 0.218234 0.230890 0.239258 0.225847 0.225788 0.263352 0.241018 0.229510 0.230599 0.231434 0.231096
chargesum: 0.00000
title: Mulliken charges with hydrogens summed into heavy atoms:
elementType: O N C C C C C C C C C C C C C C C C C
charge: -0.280662 -0.140653 0.209597 -0.154142 -0.030694 0.518872 0.105464 0.090399 -0.210202 -0.139299 0.275502 -0.000569 -0.014910 -0.113245 -0.095943 -0.013776 0.007300 -0.011622 -0.001418
polarizability: 2.23693762e+02 4.70440068e+00 2.17297450e+02 7.81684820e+00 3.55828407e+00 1.19394048e+02
1716.lowfreq: -8.8887 -7.0847 -2.8383 -0.0004 0.0005 0.0007 23.7218 28.1153 38.0119
frequency: 23.3726 27.9226 37.8308 44.7255 65.0689 72.7535 92.0121 96.5350 159.1650 205.5254 213.6370 233.0611 238.5517 276.8088 326.9130 349.1234 364.1662 382.7225 403.4680 403.8064 417.9985 466.4106 511.4778 554.7889 568.4722 613.7209 617.4083 646.5951 690.1529 704.7414 706.1046 714.0170 752.9851 785.6649 823.4033 850.6206 854.6265 857.8352 887.5540 904.1900 921.2497 932.7041 975.8779 978.9248 989.5682 989.9334 994.1233 998.2563 1000.5524 1022.8937 1027.0730 1049.7125 1061.8727 1080.7018 1094.6549 1113.3096 1120.9804 1170.5956 1172.5067 1172.7200 1185.8166 1189.1675 1211.6757 1215.5925 1233.9599 1283.3934 1313.6578 1321.0939 1330.3667 1345.4640 1377.9843 1380.9865 1384.3280 1393.3423 1421.8259 1430.9197 1440.1994 1460.2412 1466.4811 1474.0038 1478.2713 1479.6386 1484.6866 1496.6741 1550.5616 1587.7645 1592.0863 1608.3369 1614.1909 2981.0116 2985.9644 2988.4014 3038.0835 3054.2639 3067.2949 3086.5045 3093.0572 3113.8412 3116.4873 3121.2769 3123.7269 3132.1962 3133.5767 3143.8618 3144.8186 3155.3507 3162.8156 3168.0157
redmass: 4.4352 4.0983 3.9590 2.9032 2.0310 1.8642 3.4150 4.6986 3.0995 4.3591 4.5795 1.9677 1.5671 2.6042 4.7002 2.7375 2.6587 3.8223 2.8477 2.8150 3.8276 3.5052 2.9599 3.8819 5.1422 6.4281 6.3445 4.9007 4.7894 2.1036 1.6056 3.0076 1.9352 2.2728 3.4128 1.9177 1.4021 1.3452 1.7105 2.0286 1.5042 1.4755 1.3896 1.3861 5.5779 6.1255 1.3563 1.3625 1.8436 2.3653 2.2016 1.6700 1.9253 1.6231 1.7483 1.4998 1.8915 2.1119 1.0622 1.1398 1.1408 1.1234 2.1271 1.7549 3.2066 1.5190 1.3350 1.3208 1.5675 1.5333 8.0786 5.1949 1.2929 1.6948 1.2880 2.1480 2.0861 1.0879 1.1095 1.0590 1.2450 1.8711 2.0740 1.0966 6.5710 6.2431 5.9717 6.0777 6.1277 1.0386 1.0465 1.0485 1.0945 1.0921 1.0956 1.0988 1.0996 1.0874 1.0871 1.0994 1.0849 1.0905 1.0877 1.0956 1.0928 1.0961 1.1014 1.1009
irintensity: 0.1515 0.0843 0.5945 2.0028 0.1006 1.8629 0.4198 1.5737 0.1891 1.9636 0.8352 0.3436 2.2377 1.8826 0.4868 0.6754 8.2657 8.4488 0.2349 0.0012 5.7132 8.1207 15.5574 8.3343 2.1781 0.1190 0.6768 14.4743 5.5101 30.1062 103.2749 11.1221 37.1162 41.1275 5.9099 1.1029 0.2509 2.5619 0.9296 2.8631 1.9848 7.6843 0.0358 1.8140 0.2003 0.0974 0.0129 0.3776 1.8712 23.8747 6.8095 5.9308 96.6657 7.4002 3.1339 6.8895 41.2031 28.0842 0.4167 3.5994 1.0397 0.7919 2.6600 1.0606 26.8611 80.5332 0.5620 1.3765 68.8682 46.5297 0.3320 2.6099 15.2272 74.8169 73.3918 7.2354 3.4560 9.9725 3.5996 7.6078 15.4600 12.1453 18.3010 2.3311 259.3944 14.6281 1.4947 2.1147 7.2750 29.2539 37.9868 29.1756 14.2911 12.2132 29.1007 31.4055 28.5397 8.1411 7.8395 5.1639 1.1822 7.8702 2.8985 44.9357 20.7368 22.5179 25.2770 17.0822
temp: 298.150 k
press: 1.00000 atm
elementType: 8 7 6 6 6 6 6 6 6 6 6 6 6 6 6 6 6 6 6 1 1 1 1 1 1 1 1 1 1 1 1 1 1 1 1 1 1 1
symmnumber: 1
zpe: 827680.7 jmol-1
zpe.correction: 0.315247 hartree
zpe.thermalcorrener: 0.333304 hartree
zpe.thermalcorrenthalpy: 0.334248 hartree
zpe.thermalcorrgfe: 0.266615 hartree
zpe.sumelectzpe: -787.816644 hartree
zpe.sumelectthermal: -787.798587 hartree
zpe.sumelectthermalent: -787.797643 hartree
zpe.sumelectthermalfe: -787.865276 hartree
dipole: -3.6846 1.4636 0.6934
dipole: 4.0248
quadrupole: -121.9855 -101.9248 -113.8260
quadrupole: 13.0417 3.7683 0.1693
quadrupole: -9.4067 10.6539 -1.2472 13.0417 3.7683 0.1693
hfenergy: -788.1318912 hartree
pointgroup: C01 [X(C17H19N1O1)]
dipole: -1.4726846 0.5369553 0.2242957 debye
polarizability: 223.0789401|5.2599271|217.7760184|9.2180716|-0.4644134|119.5303019 unknown
InChI: InChI=1S/C17H19NO/c1-14(13-15-9-5-3-6-10-15)18(2)17(19)16-11-7-4-8-12-16/h3-12,14H,13H2,1-2H3
charge 0 multiplicity 1
38 atoms
O  3.411994 -1.991944 -0.027283
N  1.082059 -1.900773 -0.040914
C  -0.174442 -1.23164 0.408769
C  -1.251366 -1.215692 -0.722759
C  -0.714377 -1.869039 1.710374
C  -2.454817 -0.346319 -0.383303
C  2.342563 -1.297362 -0.002751
C  1.054378 -3.367256 -0.218279
C  -3.731077 -0.918672 -0.150625
C  -2.320153 1.064694 -0.284949
C  2.434561 0.211255 0.026251
C  -4.844264 -0.108802 0.172366
C  -3.428625 1.877664 0.037589
C  3.375726 0.805379 0.905086
C  1.722598 1.034898 -0.883999
C  -4.696541 1.293568 0.268486
C  3.570168 2.203207 0.904757
C  1.933897 2.43153 -0.900382
C  2.848746 3.021008 0.002688
H  0.091584 -0.185141 0.634113
H  -1.58765 -2.250493 -0.923468
H  -0.764838 -0.850399 -1.64775
H  0.061631 -1.868545 2.496257
H  -1.047144 -2.91043 1.549057
H  -1.580951 -1.291306 2.0752
H  1.066099 -3.901107 0.751136
H  1.95538 -3.667549 -0.773889
H  0.151968 -3.662299 -0.780128
H  -3.854329 -2.006399 -0.22596
H  -1.342817 1.530219 -0.466798
H  -5.823091 -0.570228 0.345851
H  -3.306311 2.964696 0.105832
H  3.958295 0.157721 1.56846
H  1.033733 0.580161 -1.605079
H  -5.557663 1.924048 0.5166
H  4.291171 2.653477 1.595909
H  1.394908 3.055931 -1.621874
H  3.008992 4.104937 -0.005792
