program: Gaussian 09
title: 000291928
version: EM64L-G09RevD.01
frameworkgroup: C1[X(C21H18N2O2)]
method: RPBEPBE
basis: SDD
operation: Freq
keyword: #p
keyword: freq=noraman
keyword: PBEPBE/SDD
title: #p freq=noraman PBEPBE/SDD
converged: YES YES NO NO
title: Mulliken charges:
elementType: O O N N C C C C C C C C C C C C C C C C C C C C C H H H H H H H H H H H H H H H H H H
charge: -0.404340 -0.307701 0.060710 -0.411747 -0.445542 -0.551540 -0.546468 0.311000 0.296814 -0.565778 -0.428537 0.482335 -0.402253 -0.399991 0.399563 0.439020 0.168423 -0.547561 -0.586664 0.112756 -0.426196 -0.411504 0.238740 -0.249346 -0.234294 0.226281 0.220104 0.229567 0.234140 0.229974 0.228555 0.292580 0.242176 0.221545 0.203594 0.196987 0.263675 0.236964 0.245849 0.291974 0.230250 0.229766 0.386120
chargesum: 0.00000
title: Mulliken charges with hydrogens summed into heavy atoms:
elementType: O O N N C C C C C C C C C C C C C C C C C C C C C
charge: -0.018220 -0.307701 0.060710 -0.119774 0.000844 -0.087833 -0.087938 0.311000 0.296814 -0.273198 -0.186361 0.482335 -0.180708 -0.196397 0.399563 0.439020 0.168423 -0.350574 -0.322990 0.112756 -0.189232 -0.165655 0.238740 -0.019096 -0.004528
polarizability: 5.64120319e+02 1.05244082e+01 2.75636416e+02 -1.92809841e+00 -1.11242746e+00 1.07429955e+02
1716.lowfreq: -6.2445 -3.9219 -0.0006 0.0007 0.0011 4.1764 10.4967 21.9884 29.2851
frequency: 10.3724 21.9640 29.2117 50.2327 86.4967 92.6539 106.4592 132.2597 153.4563 191.1741 193.9082 210.3998 228.0925 238.0431 263.5022 305.2340 323.3558 351.5340 358.5448 390.3792 402.2247 420.4554 432.5781 434.3656 467.0457 481.5581 530.3474 536.9233 556.7547 571.3772 592.2932 608.9699 620.1376 621.3193 623.1392 641.2730 714.5696 724.6367 744.4418 746.7842 756.4847 771.5495 777.8022 795.9453 825.4423 845.2082 850.2831 866.8833 876.8961 880.6090 899.6857 907.3048 911.5398 913.3429 930.2896 939.8653 952.9419 962.5117 963.2601 989.9648 1014.4129 1018.7401 1021.2874 1049.2876 1088.9255 1094.3893 1127.8080 1135.4703 1155.2209 1166.4242 1171.9763 1179.3372 1200.8227 1214.3128 1227.1517 1231.3644 1250.2772 1261.7359 1281.8835 1284.5348 1291.9930 1295.6038 1313.3416 1317.2705 1338.1362 1364.9349 1390.3753 1414.6839 1432.4961 1436.0394 1441.0075 1456.2824 1458.3758 1459.0660 1478.3163 1485.8983 1514.7010 1529.2696 1559.9061 1565.5948 1573.9971 1592.3920 1623.7684 1624.4704 1658.6929 2862.8506 2955.3940 2970.1852 2977.6365 3006.5200 3045.4473 3053.5060 3079.9329 3102.2569 3113.7215 3117.2622 3128.2747 3141.2234 3145.4203 3150.7838 3159.7882 3164.0511 3406.8018
redmass: 4.2970 5.3155 5.6869 4.2042 5.8604 5.6651 4.6124 5.1714 2.5580 3.2915 5.1579 2.7754 5.4856 4.0374 3.2198 4.8683 5.1919 5.6633 3.5139 5.8698 6.5574 3.4099 4.8082 3.8999 2.4979 5.6772 4.6677 3.6401 3.4043 3.3435 6.6398 2.8456 1.9476 3.6649 3.1771 5.3623 2.7779 6.3822 3.4877 3.0740 1.5463 2.3703 4.8163 4.3800 1.3931 1.4093 2.3135 4.1265 1.4922 1.6194 1.3760 5.2655 1.4635 2.3754 1.3941 1.4709 2.9212 1.4029 1.4643 1.3429 5.0560 2.3129 2.4581 1.6896 4.2039 2.6268 1.2979 1.7261 1.6026 1.2604 1.1015 1.4893 1.5540 1.4245 2.3173 1.5858 1.8520 1.2419 2.2805 2.1146 1.3812 2.5256 1.6203 1.6138 2.0286 2.7808 3.7480 3.6270 4.1164 3.3300 4.2069 1.1216 1.1918 2.4964 1.1064 2.5062 3.6873 1.9446 4.7750 6.9832 5.0991 5.4326 5.6272 6.4184 5.1669 1.0698 1.0867 1.0660 1.0661 1.0644 1.0946 1.0946 1.1040 1.0897 1.0876 1.0875 1.0874 1.0962 1.0949 1.0929 1.0921 1.1001 1.0749
irintensity: 0.0073 0.3821 0.7560 0.8697 2.7230 3.4296 1.3063 0.9158 0.1598 1.1342 1.5890 21.8333 4.5256 1.7233 0.8896 2.2316 26.7267 0.3082 4.3491 23.4472 5.1198 3.6986 6.3722 2.9220 17.0711 1.1440 1.9135 1.5763 2.6123 7.7336 7.6971 13.9180 48.9536 6.0962 11.2556 1.4982 9.7210 31.9727 1.1206 1.8211 45.6215 2.2102 4.7760 1.1091 24.5370 0.1240 6.4590 42.8630 122.0352 8.6495 78.4720 3.0559 21.4398 6.4724 5.4595 29.4099 6.7328 1.1901 26.7421 0.2986 23.3040 3.3955 9.6640 8.4155 56.9471 7.8456 1.2916 51.7015 7.7287 14.2569 6.6981 34.3328 1.1358 12.4839 405.5042 70.2301 73.8022 1.6654 7.1701 1.9630 13.7520 248.3131 117.6147 61.2384 63.6707 70.7727 16.8851 10.6984 35.9565 65.0172 17.3537 12.5431 14.5098 62.5174 9.5295 61.1988 217.6475 318.6369 97.7333 34.0845 17.5079 71.2853 0.7859 21.2346 204.1167 816.6098 64.3391 35.4767 25.5044 42.8460 36.8801 30.5411 54.0328 23.4809 12.0266 6.9425 0.2610 28.1812 28.0879 0.6517 6.1271 41.7721 22.0860
temp: 298.150 k
press: 1.00000 atm
elementType: 8 8 7 7 6 6 6 6 6 6 6 6 6 6 6 6 6 6 6 6 6 6 6 6 6 1 1 1 1 1 1 1 1 1 1 1 1 1 1 1 1 1 1
symmnumber: 1
zpe: 886428.7 jmol-1
zpe.correction: 0.337623 hartree
zpe.thermalcorrener: 0.358023 hartree
zpe.thermalcorrenthalpy: 0.358967 hartree
zpe.thermalcorrgfe: 0.285931 hartree
zpe.sumelectzpe: -1069.259152 hartree
zpe.sumelectthermal: -1069.238753 hartree
zpe.sumelectthermalent: -1069.237808 hartree
zpe.sumelectthermalfe: -1069.310844 hartree
dipole: 2.3339 -5.7186 -0.0788
dipole: 6.1770
quadrupole: -109.1499 -142.0076 -152.1375
quadrupole: 8.8244 -0.6808 0.4236
quadrupole: 25.2818 -7.5760 -17.7058 8.8244 -0.6808 0.4236
hfenergy: -1069.5967752 hartree
pointgroup: C01 [X(C21H18N2O2)]
dipole: -0.9285478 2.2425829 0.1206981 debye
polarizability: 563.9469838|11.4320704|274.7187982|6.6949719|13.140851|108.5209079 unknown
InChI: InChI=1S/C21H18N2O2/c24-20-12-18-5-2-1-4-17(18)11-19(20)21(25)23-22-13-14-8-9-15-6-3-7-16(15)10-14/h1-2,4-5,8-13,23-24H,3,6-7H2
charge 0 multiplicity 1
43 atoms
O  2.979304 -3.092398 -0.366174
O  0.626127 -2.171842 -0.176464
N  -1.181852 -0.087281 -0.090784
N  0.18939 0.116128 -0.08505
C  -7.760411 -1.032022 0.337823
C  -6.386745 -1.629259 -0.102383
C  -7.716706 0.46012 -0.120022
C  -5.462283 -0.418093 -0.09544
C  -6.229267 0.783689 -0.105057
C  -4.06151 -0.375766 -0.098879
C  -5.586764 2.037509 -0.116985
C  -3.402133 0.890745 -0.105134
C  -4.174294 2.08647 -0.114333
C  -1.940092 0.991099 -0.101415
C  4.47329 0.842927 0.160169
C  5.371575 -0.285934 -0.016379
C  2.525096 -0.676574 -0.054426
C  3.069499 0.607979 0.135521
C  4.825214 -1.587191 -0.194289
C  3.439847 -1.803021 -0.207654
C  5.023068 2.15596 0.3552
C  6.788894 -0.045631 0.005873
C  1.063398 -0.966604 -0.103608
C  6.402773 2.355222 0.372216
C  7.29115 1.241709 0.194918
H  -7.841044 -1.073344 1.439989
H  -8.619439 -1.58194 -0.083538
H  -6.452329 -2.050825 -1.126096
H  -6.039882 -2.442665 0.55906
H  -8.313849 1.126603 0.528049
H  -8.117868 0.566133 -1.149169
H  -3.451996 -1.285518 -0.091216
H  -6.169319 2.96578 -0.122215
H  -3.66212 3.057255 -0.115345
H  -1.512439 2.016287 -0.108337
H  2.420806 1.480602 0.290506
H  5.480336 -2.455137 -0.317331
H  4.339838 3.00364 0.490689
H  7.470502 -0.893531 -0.127026
H  0.571121 1.07218 -0.090671
H  6.815963 3.358489 0.520436
H  8.373612 1.410678 0.209987
H  1.950542 -3.058427 -0.314209
