program: Gaussian 09
title: 000291899
version: EM64L-G09RevD.01
frameworkgroup: C1[X(C6H9Cl3O2)]
method: RPBEPBE
basis: SDD
operation: Freq
keyword: #p
keyword: freq=noraman
keyword: PBEPBE/SDD
title: #p freq=noraman PBEPBE/SDD
converged: NO YES NO NO
title: Mulliken charges:
elementType: Cl Cl Cl O O C C C C C C H H H H H H H H H
charge: -0.042860 -0.044654 -0.052653 -0.279352 -0.231050 0.103476 -0.365412 -0.624564 -0.574674 0.308976 -0.759805 0.292801 0.318410 0.288766 0.302740 0.293859 0.300340 0.255655 0.256920 0.253078
chargesum: 0.00000
title: Mulliken charges with hydrogens summed into heavy atoms:
elementType: Cl Cl Cl O O C C C C C C
charge: -0.042860 -0.044654 -0.052653 -0.279352 -0.231050 0.396277 -0.047001 -0.033057 0.019524 0.308976 0.005850
polarizability: 1.08025889e+02 -1.43123151e+00 8.34269532e+01 2.18633137e+00 -1.63572326e+00 1.02796455e+02
1716.lowfreq: -29.8482 -7.3216 -3.5838 -0.0008 -0.0007 0.0017 2.0614 31.3705 50.6497
frequency: -29.7588 31.3159 50.6171 62.1111 76.9861 105.2489 117.8043 184.1255 196.6077 208.3365 258.4175 282.7537 312.5897 418.4392 482.0094 530.8674 574.4946 606.0736 637.6269 667.9929 702.3281 812.3246 836.6000 921.0449 949.7499 997.8428 1024.3808 1046.0544 1076.0529 1121.1841 1131.0116 1176.3693 1178.4991 1201.4320 1260.7352 1277.3626 1315.8157 1323.1312 1355.1753 1386.8818 1441.6991 1445.2015 1454.5958 1457.6505 1654.9359 3010.1701 3021.7982 3078.9505 3086.5717 3098.7632 3100.5099 3142.3607 3169.6935 3177.7661
redmass: 1.0899 14.6711 7.6611 8.1391 5.1278 9.1351 4.5870 3.5820 8.5324 3.5439 5.8594 12.8241 5.0727 3.9511 3.4490 4.0093 3.3878 4.7063 6.5865 5.6759 6.1441 2.2742 3.1764 3.6282 1.7139 1.9460 1.7530 1.6354 4.0301 1.3645 1.3067 1.5323 3.3658 1.1679 1.1477 1.1799 1.2073 1.3446 1.7844 1.2182 1.0930 1.0952 1.0586 1.0535 10.7556 1.0369 1.0832 1.0558 1.0570 1.0967 1.0862 1.1014 1.1122 1.1124
irintensity: 1.6884 0.0815 2.4747 1.0713 1.3205 3.2732 0.7093 4.1399 0.4957 10.8536 13.2263 0.3000 16.5897 7.9477 10.3715 3.9606 4.8513 3.4285 74.8811 14.3821 43.4007 9.3880 10.3454 103.1703 8.3152 52.1068 9.3992 9.6624 0.8862 15.0881 6.8650 8.8066 354.7435 4.3526 0.7618 2.1435 4.4701 11.3588 0.8888 53.8225 27.6970 7.4901 15.3863 16.1564 164.1314 1.0790 5.7755 6.9108 6.4724 4.2907 0.5327 6.1093 0.4850 2.3346
temp: 298.150 k
press: 1.00000 atm
elementType: 17 17 17 8 8 6 6 6 6 6 6 1 1 1 1 1 1 1 1 1
symmnumber: 1
zpe: 378253.6 jmol-1
zpe.correction: 0.144069 hartree
zpe.thermalcorrener: 0.156643 hartree
zpe.thermalcorrenthalpy: 0.157587 hartree
zpe.thermalcorrgfe: 0.102358 hartree
zpe.sumelectzpe: -1763.803013 hartree
zpe.sumelectthermal: -1763.790439 hartree
zpe.sumelectthermalent: -1763.789495 hartree
zpe.sumelectthermalfe: -1763.844724 hartree
dipole: -1.8679 0.4670 2.5075
dipole: 3.1615
quadrupole: -83.2708 -86.5510 -92.9384
quadrupole: 2.8373 -6.8548 -2.2642
quadrupole: 4.3159 1.0358 -5.3517 2.8373 -6.8548 -2.2642
hfenergy: -1763.947082 hartree
pointgroup: C01 [X(C6H9Cl3O2)]
dipole: -0.5162598 0.4758676 1.0266998 debye
dipolederiv: -0.2159998 -0.0082992 -0.0911038 0.0080047 -0.3662451 0.2147388 -0.1527432 0.1759243 -0.4987209 -0.32713 0.1419018 0.1141795 0.1407215 -0.3574939 -0.1046278 0.1482303 -0.1636084 -0.2590985 -0.1764758 -0.0064508 -0.01933 -0.0247921 -0.393976 0.1955907 -0.0032657 0.2351518 -0.4287325 -1.5152804 0.3690168 -0.1332246 0.4237846 -0.5681354 -0.0997439 -0.1666429 -0.0337884 -0.4340662 -0.7043219 0.1353319 -0.0302055 0.0393063 -0.3880986 -0.1826105 -0.3716908 -0.0514346 -0.7908471 0.531428 -0.0879778 0.0217855 -0.1953599 0.3381936 0.1358804 -0.2993905 0.1040572 -0.006034 0.2220747 0.0549262 0.1585544 -0.0238363 0.2332159 -0.2714182 0.2415657 -0.2022553 0.5702797 0.2480243 -0.2646856 -0.2053405 -0.2210997 0.2890396 0.1500077 -0.1670934 0.1949923 0.3310945 0.1204721 -0.0523845 -0.0055885 0.0127524 0.3463892 -0.3100348 -0.0582392 -0.3009781 0.4692225 1.767822 -0.5540688 0.0963832 -0.4255776 0.4460279 0.2538045 0.5965982 0.0693515 1.0182283 -0.2821336 0.1784727 0.1684782 0.1708172 -0.0941709 -0.1157818 0.1004292 -0.0839587 -0.0978843 0.0527764 0.0238055 -0.0423886 0.0312692 0.0626983 0.0287416 0.0851084 0.0156343 0.0225784 0.014855 0.0370512 0.0009694 0.0510158 0.0735343 0.0265198 0.0110181 0.0103415 -0.0177941 0.076256 0.0730519 0.0338716 0.0423956 0.0496905 -0.0288768 0.0448583 0.0568018 -0.0392472 -0.0504926 -0.0197388 0.0006507 0.0040682 0.0674663 -0.0368084 -0.0030711 -0.0610583 0.0466901 -0.025675 -0.055221 -0.0507139 -0.034659 0.0450077 0.0491769 -0.0463835 0.0270339 0.0066567 0.0664382 0.0876366 0.0570984 0.0489133 0.0444969 0.0545271 0.0563491 0.0050325 -0.0157168 0.1264903 0.0138022 0.0023216 0.0461217 -0.0249758 0.0434237 0.0171041 0.0672462 0.0690892 0.0873965 -0.0006381 -0.0895687 0.0038731 0.1237997 0.0027993 -0.045283 -0.0211358 -0.0421709 -0.0165245 -0.0655322 0.0131715 -0.097719 0.0735358 -0.0053085 0.012542 -0.0433496 0.096473 unknown
polarizability: 98.2630431|-12.0454229|93.841678|-0.5277743|-3.8487906|102.1445765 unknown
InChI: InChI=1S/C6H9Cl3O2/c1-4(10)11-6(3-8)5(9)2-7/h5-6H,2-3H2,1H3
charge 0 multiplicity 1
20 atoms
Cl 1.879661 -0.756562 2.041901
Cl 1.213879 -2.832826 -1.401034
Cl 1.626188 2.281526 -1.253158
O  -0.828308 0.129142 0.633357
O  -2.319961 0.097526 -1.164763
C  0.210959 -0.494554 -0.238749
C  1.574438 -0.04923 0.293444
C  -0.034065 -2.00795 -0.250829
C  1.744489 1.459205 0.450956
C  -2.073451 0.400347 0.021595
C  -3.006061 1.084888 0.992107
H  0.091236 -0.096398 -1.265796
H  2.370814 -0.497677 -0.319928
H  0.11315 -2.46022 0.739229
H  -1.021927 -2.23705 -0.672095
H  2.740114 1.716751 0.83474
H  0.94479 1.900099 1.059945
H  -3.213868 2.108731 0.633768
H  -2.573726 1.130732 2.001533
H  -3.968546 0.546617 1.016977
