program: Gaussian 09
title: 000291906
version: EM64L-G09RevD.01
frameworkgroup: C1[X(C12H22O3)]
method: RPBEPBE
basis: SDD
operation: Freq
keyword: #pfreq=noraman
keyword: PBEPBE/SDD
title: #p freq=noraman PBEPBE/SDD
converged: NO YES NO NO
title: Mulliken charges:
elementType: O O O C C C C C C C C C C C C H H H H H H H H H H H H H H H H H H H H H H
charge: -0.324741 -0.456877 -0.448228 -0.109653 -0.064033 -0.008848 -0.126540 -0.461711 -0.467917 -0.457348 -0.454304 -0.402905 -0.402458 -0.246885 -0.323285 0.224248 0.224656 0.180838 0.188901 0.232064 0.185563 0.244206 0.184526 0.204125 0.215047 0.190498 0.218510 0.191909 0.199525 0.192713 0.199701 0.334042 0.183492 0.205273 0.206520 0.197918 0.351457
chargesum: 0.00000
title: Mulliken charges with hydrogens summed into heavy atoms:
elementType: O O O C C C C C C C C C C C C
charge: -0.324741 -0.122835 -0.096771 0.114596 0.160623 0.171990 0.062360 -0.044084 -0.039184 -0.038176 -0.045296 -0.011472 -0.010044 0.141880 0.081154
polarizability: 1.56150717e+02 -7.11049389e-01 1.38410219e+02 3.53044531e+00 -1.07119264e+00 1.10168064e+02
1716.lowfreq: -18.3457 -4.7200 -0.0004 0.0006 0.0008 15.3662 29.9824 45.1569 75.0861
frequency: 29.4012 44.8543 75.0511 88.9182 95.6594 139.8889 189.4565 216.3300 241.9426 251.0849 277.0918 280.4285 300.1563 305.0481 372.8294 382.0540 401.5289 446.5447 463.3515 463.9473 474.0541 499.8483 509.5396 552.3154 599.3304 785.4507 817.5323 821.6081 839.4282 844.5115 865.6606 873.6150 904.2359 906.7145 944.2884 983.9408 990.5523 1002.0408 1010.5058 1014.3677 1042.4546 1058.6340 1059.3061 1070.5601 1083.3793 1091.4355 1112.3016 1119.2384 1134.3595 1142.6900 1147.3003 1187.3009 1190.3342 1205.3977 1207.2563 1216.1547 1244.8760 1261.0067 1276.2127 1286.1310 1288.3432 1297.9592 1302.0793 1319.3811 1328.0475 1329.4163 1332.9907 1337.9108 1340.1421 1344.2432 1348.9078 1352.0592 1375.5834 1385.2459 1389.1527 1461.4433 1461.7622 1462.5726 1462.8118 1467.8865 1469.5834 1470.7084 1475.0781 2905.2053 2911.7804 2939.3553 2940.7833 2948.1263 2957.4875 2964.6440 2966.0738 2966.6395 2968.7934 2971.6407 2985.6559 3006.0425 3026.1862 3029.6682 3034.0881 3049.8336 3053.6893 3057.8711 3078.5841 3537.3519 3558.0577
redmass: 4.1406 4.4364 3.3141 3.2247 3.7436 2.6693 2.8745 4.0985 2.3172 2.7645 1.9379 1.8347 1.9832 1.8036 3.9746 3.2081 2.9631 3.2041 2.3513 2.1891 1.4258 2.2509 2.5680 2.1363 2.9342 1.8171 2.2415 1.8892 1.5567 2.4954 1.9850 2.3001 2.3302 1.6288 2.6326 2.3961 1.9264 2.8652 1.9995 3.2678 2.3253 1.2615 4.2910 1.6869 1.8513 1.7466 2.2575 2.2010 1.7341 2.0645 1.8247 1.2410 1.3123 1.2402 1.3319 1.3937 1.3430 1.2961 1.2807 1.3106 1.2991 1.2133 1.1803 1.3449 1.3537 1.2605 1.3692 1.4735 1.4370 1.5240 1.5650 1.4509 1.3960 1.2864 1.6492 1.0874 1.0882 1.0876 1.0877 1.0918 1.0824 1.0897 1.0956 1.0819 1.0823 1.0565 1.0792 1.0740 1.0691 1.0656 1.0698 1.0645 1.0676 1.0629 1.0627 1.1015 1.0967 1.1003 1.1006 1.1018 1.0954 1.0953 1.0967 1.0651 1.0661
irintensity: 2.5197 1.9972 0.7359 0.5066 1.1159 3.4712 7.4935 5.2683 1.5525 0.2334 25.1206 60.5691 39.9307 16.4596 4.7188 2.5992 1.7960 11.9366 11.5346 40.3880 122.9352 0.7610 2.8172 4.0994 13.7594 2.1934 8.0017 7.0983 0.2876 18.3457 7.4232 18.3976 11.3564 7.5343 39.2665 25.1834 3.3084 12.0856 10.0825 179.2778 12.6162 2.1567 91.4892 7.9548 23.6418 3.8747 1.2604 13.0301 3.6396 4.6812 4.0503 5.6479 6.4091 24.6528 5.8050 7.3144 3.8271 5.6824 5.4888 1.9225 0.1540 10.5216 9.2357 0.4758 8.0753 6.3617 3.0565 1.1534 3.8831 3.1338 0.4061 27.4567 1.8050 31.2845 5.7617 3.4213 6.3870 7.7819 7.3938 15.3351 15.7614 8.3487 2.4627 28.6280 25.2871 57.5693 0.7566 7.4516 0.8136 19.0158 36.9730 39.7061 100.2810 83.3096 24.0769 77.9024 77.5790 41.7279 77.5855 50.8753 39.5716 38.1036 44.2650 8.0076 2.8544
temp: 298.150 k
press: 1.00000 atm
elementType: 8 8 8 6 6 6 6 6 6 6 6 6 6 6 6 1 1 1 1 1 1 1 1 1 1 1 1 1 1 1 1 1 1 1 1 1 1
symmnumber: 1
zpe: 855941.9 jmol-1
zpe.correction: 0.326011 hartree
zpe.thermalcorrener: 0.341538 hartree
zpe.thermalcorrenthalpy: 0.342483 hartree
zpe.thermalcorrgfe: 0.282975 hartree
zpe.sumelectzpe: -694.904225 hartree
zpe.sumelectthermal: -694.888698 hartree
zpe.sumelectthermalent: -694.887754 hartree
zpe.sumelectthermalfe: -694.947261 hartree
dipole: 1.0537 -1.6477 -1.2987
dipole: 2.3478
quadrupole: -112.8305 -85.4123 -90.6237
quadrupole: -0.4462 13.0469 -1.8072
quadrupole: -16.5417 10.8765 5.6652 -0.4462 13.0469 -1.8072
hfenergy: -695.2302361 hartree
pointgroup: C01 [X(C12H22O3)]
dipole: 0.3704689 -0.6769827 -0.5075741 debye
polarizability: 155.9691533|-1.8777467|138.5733424|3.4983127|-1.43695|110.1865038 unknown
InChI: InChI=1S/C12H22O3/c13-7-8-15-12-6-5-11(14)9-3-1-2-4-10(9)12/h9-14H,1-8H2
charge 0 multiplicity 1
37 atoms
O  -2.009405 0.24943 -0.024304
O  3.118411 -2.263735 0.000217
O  -4.534064 0.508936 1.18937
C  0.403827 0.421638 0.140468
C  1.781687 -0.249613 -0.137909
C  -0.756724 -0.436368 -0.407622
C  1.812508 -1.694938 0.395023
C  0.383562 1.859822 -0.434665
C  2.932241 0.6063 0.446898
C  -0.713194 -1.878281 0.144278
C  0.650108 -2.536414 -0.170088
C  1.536937 2.718323 0.133017
C  2.909407 2.047996 -0.11009
C  -3.203966 -0.165685 -0.775735
C  -4.335859 0.718714 -0.247679
H  0.265624 0.48837 1.242728
H  1.924338 -0.311537 -1.239784
H  -0.694052 -0.464565 -1.522147
H  1.735065 -1.672258 1.50793
H  -0.595041 2.323968 -0.217669
H  0.478928 1.804119 -1.540702
H  3.89494 0.111605 0.227816
H  2.828551 0.639327 1.552973
H  -1.531757 -2.487319 -0.282777
H  -0.875378 -1.834547 1.239856
H  0.678122 -3.562088 0.250801
H  0.789666 -2.630005 -1.26588
H  1.386515 2.854362 1.22437
H  1.515264 3.728464 -0.320276
H  3.11447 2.020759 -1.200598
H  3.718311 2.646408 0.352221
H  3.162182 -3.204965 0.306294
H  -3.049189 -0.012491 -1.866528
H  -3.43524 -1.23437 -0.586424
H  -5.292695 0.454619 -0.728845
H  -4.10054 1.782077 -0.464529
H  -3.63426 0.567442 1.605492
