program: Gaussian 09
title: 000291961
version: EM64L-G09RevD.01
frameworkgroup: C1[X(C14H30O8P2)]
method: RPBEPBE
basis: SDD
operation: Freq
keyword: #p
keyword: freq=noraman
keyword: PBEPBE/SDD
title: #p freq=noraman PBEPBE/SDD
converged: YES YES NO NO
title: Mulliken charges:
elementType: P P O O O O O O O O C C C C C C C C C C C C C C H H H H H H H H H H H H H H H H H H H H H H H H H H H H H H
charge: 1.282838 1.296274 -0.522701 -0.505715 -0.511384 -0.526936 -0.620562 -0.278846 -0.628284 -0.203290 -0.625448 -0.325862 -0.809397 0.290704 -0.245910 -0.217166 -0.255433 -0.254642 -0.256694 -0.652861 -0.666715 -0.660288 -0.651427 -0.664827 0.341612 0.254113 0.282362 0.283503 0.307048 0.228511 0.219268 0.219101 0.236176 0.274179 0.213958 0.219532 0.238645 0.220277 0.242009 0.231244 0.254725 0.214614 0.239856 0.233334 0.207151 0.224041 0.234542 0.207634 0.253251 0.216964 0.212629 0.254462 0.227622 0.222208
chargesum: 0.00000
title: Mulliken charges with hydrogens summed into heavy atoms:
elementType: P P O O O O O O O O C C C C C C C C C C C C C C
charge: 1.282838 1.296274 -0.522701 -0.505715 -0.511384 -0.526936 -0.620562 -0.278846 -0.628284 -0.203290 -0.283836 0.210612 -0.218846 0.290704 0.201869 0.238112 0.232704 0.203535 0.205593 0.047723 0.013626 0.005929 0.031416 0.039466
polarizability: 2.79575482e+02 -8.98270137e+00 2.23105643e+02 5.10876430e-02 2.83664025e-03 1.95937431e+02
1716.lowfreq: -13.5864 -9.8684 -8.2313 -1.7856 0.0005 0.0013 0.0013 11.5805 16.4073
frequency: -9.6911 10.3842 15.5978 20.5872 25.8368 32.2207 37.1982 40.6510 48.0983 54.3236 65.1279 75.3004 79.4037 90.4268 97.9984 100.3807 105.8668 132.4490 137.2629 137.8685 143.4209 149.0376 173.0166 187.4778 193.9621 207.1080 222.0151 241.0759 242.2853 247.5366 251.4242 255.4593 265.2786 275.7459 296.7791 321.6554 328.2264 347.6817 359.0518 370.3147 401.0304 416.8062 423.2170 448.7127 462.8929 505.6793 568.4328 600.5635 620.7745 656.3979 663.0720 681.2369 726.9176 746.4917 784.9210 795.9846 802.6332 804.8906 807.5577 815.8028 820.3636 859.0701 862.4888 870.6281 874.6722 919.6998 965.5718 1004.9499 1009.9020 1010.6723 1013.5107 1017.4486 1027.9800 1035.2925 1052.0899 1076.7459 1092.2549 1093.5732 1095.4018 1102.3360 1104.0199 1110.4889 1128.0817 1133.4443 1144.7696 1145.8740 1152.2687 1157.2913 1228.0517 1248.3411 1256.0298 1265.6030 1267.8505 1273.0256 1277.8013 1288.9686 1310.0285 1349.6131 1351.9407 1352.9147 1358.8257 1364.6696 1372.7091 1389.9880 1391.0278 1392.2899 1392.6193 1393.3644 1420.6824 1455.3548 1456.7507 1457.1761 1461.6785 1461.8302 1463.2330 1463.4912 1466.6671 1466.7282 1473.1979 1477.8623 1481.7049 1484.5750 1484.9284 1487.5516 1500.8841 1643.2078 2974.1291 2984.6686 2989.1400 2992.4140 2992.7151 2995.3991 2995.5098 2996.9784 3005.1235 3013.1599 3029.7568 3034.4490 3040.8015 3055.0921 3059.7432 3073.6240 3074.7262 3078.3964 3081.2643 3084.9447 3089.7357 3090.3676 3090.7837 3094.2765 3103.8219 3106.2092 3106.8039 3108.9550 3111.6577 3120.0835
redmass: 2.8202 4.0016 3.8558 3.8316 3.0060 3.0051 3.3122 3.4555 3.4286 3.1345 2.9391 3.5356 4.1577 3.5984 2.3066 2.4408 3.8065 3.7976 4.2502 3.4245 4.2210 5.4708 2.7918 3.4856 2.6737 1.6379 1.9249 1.3105 1.3708 1.6457 2.2504 2.1412 1.7627 3.4301 3.4022 4.5025 6.3185 5.5050 4.4359 4.3554 4.8001 4.2951 3.6526 4.5169 4.5768 5.3721 5.0303 5.7273 7.3547 6.2613 6.3218 4.8789 2.6117 4.7014 1.7475 2.1173 1.1243 1.1248 1.0902 1.6730 1.0977 3.6309 3.3211 4.3352 4.0756 3.8161 1.8341 2.8780 2.7142 2.8000 2.9191 3.1956 5.8870 5.0847 3.9546 2.6015 2.1265 2.1596 2.2675 2.2361 2.3080 2.8158 1.4185 1.4246 1.5034 1.5568 1.4105 1.6697 1.3473 1.3279 1.1486 1.1451 1.1199 1.1128 1.1190 1.3074 1.1692 1.2219 1.2189 1.2770 1.2443 1.3777 1.2269 1.2247 1.2286 1.2502 1.2344 1.2397 1.0865 1.0407 1.0399 1.0895 1.0426 1.0421 1.0726 1.0495 1.0724 1.0748 1.0660 1.0516 1.0533 1.0516 1.0652 1.0535 1.0830 9.3434 1.0567 1.0357 1.0376 1.0412 1.0362 1.0582 1.0361 1.0547 1.0616 1.0622 1.0587 1.0588 1.1081 1.0865 1.1072 1.1029 1.1029 1.0985 1.0977 1.0971 1.0984 1.0981 1.0979 1.1039 1.1041 1.1021 1.1033 1.1021 1.1031 1.1061
irintensity: 1.1422 0.4827 0.9642 0.4917 1.8331 0.0391 0.7387 1.0556 0.4888 1.4219 0.5410 2.1904 1.0968 0.1575 3.4723 3.3598 3.3321 0.7360 1.4006 4.1640 5.9829 12.1848 3.8245 3.3262 4.9813 6.4377 1.0401 2.5810 2.4058 4.2346 4.5285 4.6249 3.9615 21.6883 14.5878 8.6713 31.5026 7.1137 16.4812 7.8326 19.5272 3.8950 13.9702 5.0174 37.3090 25.0109 1.0381 50.9809 82.6180 101.7025 91.5516 25.8997 48.8711 28.5440 6.0174 14.1173 4.3183 6.1394 4.4308 6.7403 2.2747 99.0979 238.4633 112.1261 109.1608 18.4212 12.9090 6.9294 160.8474 160.0261 101.6239 199.2891 87.1388 12.0592 48.1053 22.3213 15.5089 7.8462 63.0118 7.7281 12.1921 212.6057 3.4438 6.5627 15.1295 5.0405 49.6709 13.1771 57.3039 121.0205 0.8518 1.0175 1.6610 0.2653 6.5024 29.4902 3.2198 9.8013 11.6003 2.2025 6.6192 3.1378 1.4688 31.9900 23.5202 23.4603 17.8027 32.1928 11.1691 10.6897 10.1475 11.3938 12.8325 12.3770 24.4452 4.7759 3.4079 2.3115 4.8570 5.7680 14.9037 14.4280 9.8175 17.5095 3.9025 151.7262 14.8777 18.0155 20.6806 18.1711 27.2459 13.6918 17.7006 55.4741 37.6274 3.9157 26.4553 5.7185 8.7504 0.8132 9.5496 6.8431 2.2476 0.5293 47.2464 36.5195 25.5202 28.3940 29.1842 1.8977 33.6086 31.7611 4.5833 37.9402 23.1725 27.1980
temp: 298.150 k
press: 1.00000 atm
elementType: 15 15 8 8 8 8 8 8 8 8 6 6 6 6 6 6 6 6 6 6 6 6 6 6 1 1 1 1 1 1 1 1 1 1 1 1 1 1 1 1 1 1 1 1 1 1 1 1 1 1 1 1 1 1
symmnumber: 1
zpe: 1152651.8 jmol-1
zpe.correction: 0.439022 hartree
zpe.thermalcorrener: 0.471243 hartree
zpe.thermalcorrenthalpy: 0.472187 hartree
zpe.thermalcorrgfe: 0.369529 hartree
zpe.sumelectzpe: -1833.743540 hartree
zpe.sumelectthermal: -1833.711319 hartree
zpe.sumelectthermalent: -1833.710375 hartree
zpe.sumelectthermalfe: -1833.813034 hartree
dipole: 5.2311 4.6899 -3.2088
dipole: 7.7238
quadrupole: -130.7982 -160.6122 -166.8719
quadrupole: -16.9043 -7.7723 -3.2449
quadrupole: 21.9626 -7.8515 -14.1111 -16.9043 -7.7723 -3.2449
hfenergy: -1834.1825624 hartree
pointgroup: C01 [X(C14H30O8P2)]
dipole: -2.1366093 1.5804261 1.4735062 debye
polarizability: 279.1890182|8.427146|222.1231194|6.130506|5.4418444|197.3064176 unknown
InChI: InChI=1S/C14H30O8P2/c1-6-18-14(15)13(24(17,21-9-4)22-10-5)11-12-23(16,19-7-2)20-8-3/h13H,6-12H2,1-5H3
charge 0 multiplicity 1
54 atoms
P  -1.295181 1.189118 0.146003
P  3.043513 -1.061892 0.755105
O  -1.2768 1.82828 1.766967
O  -2.880752 1.525327 -0.475851
O  3.277988 -0.725014 -0.935597
O  3.964099 0.140134 1.627109
O  -0.170119 1.741828 -0.836409
O  -3.412678 -1.5256 0.494151
O  3.417588 -2.571618 1.09001
O  -2.012724 -2.023308 -1.310454
C  -1.175198 -0.673151 0.581588
C  0.259772 -1.175006 0.294191
C  1.318988 -0.47325 1.166317
C  -2.205767 -1.47412 -0.205468
C  -0.9677 3.278804 1.976151
C  -4.055007 1.686492 0.438456
C  3.075247 0.667346 -1.455695
C  5.364303 -0.206377 2.008248
C  -4.528113 -2.285403 -0.163778
C  0.541081 3.527232 2.045515
C  -5.273458 1.795717 -0.473391
C  3.445068 0.616165 -2.935159
C  6.335756 -0.028672 0.836541
C  -4.439043 -3.774476 0.176654
H  -1.429608 -0.710252 1.654943
H  0.285525 -2.264779 0.483614
H  0.480381 -1.035672 -0.778717
H  1.170445 -0.67928 2.240541
H  1.319554 0.619112 1.017833
H  -1.466405 3.506592 2.933411
H  -1.435124 3.880256 1.172023
H  -3.913114 2.602229 1.042263
H  -4.123522 0.813562 1.112815
H  2.019034 0.970484 -1.31423
H  3.732755 1.356743 -0.891636
H  5.584806 0.490187 2.834331
H  5.38288 -1.2456 2.38862
H  -5.43594 -1.817118 0.249575
H  -4.468611 -2.113739 -1.252698
H  1.008825 2.881503 2.808638
H  1.015674 3.333276 1.068923
H  0.732305 4.581181 2.322875
H  -5.165306 2.64591 -1.167689
H  -5.397042 0.875986 -1.070042
H  -6.18555 1.950182 0.133066
H  4.495167 0.303388 -3.066284
H  2.798126 -0.099512 -3.469996
H  3.31059 1.615154 -3.390208
H  6.098069 -0.731188 0.018565
H  6.292672 1.001661 0.441827
H  7.37049 -0.228663 1.173379
H  -3.528686 -4.222551 -0.254922
H  -4.43432 -3.930785 1.269025
H  -5.314131 -4.303426 -0.244152
