program: Gaussian 09
title: 000291907
version: EM64L-G09RevD.01
frameworkgroup: C1[X(C13H17NO3)]
method: RPBEPBE
basis: SDD
operation: Freq
keyword: #p
keyword: freq=noraman
keyword: PBEPBE/SDD
title: #p freq=noraman PBEPBE/SDD
converged: NO YES NO NO
title: Mulliken charges:
elementType: O O O N C C C C C C C C C C C C C H H H H H H H H H H H H H H H H H
charge: -0.259686 -0.247937 -0.282334 -0.154442 0.316840 -0.434124 -0.089865 -0.425259 -0.308957 -0.683016 -0.325275 0.371916 -0.348950 -0.381298 -0.223532 -0.197001 -0.255907 0.230970 0.240091 0.248967 0.243617 0.227198 0.187627 0.226630 0.217738 0.222889 0.239569 0.240867 0.217644 0.254673 0.248601 0.225092 0.227921 0.228733
chargesum: 0.00000
title: Mulliken charges with hydrogens summed into heavy atoms:
elementType: O O O N C C C C C C C C C C C C C
charge: -0.259686 -0.247937 -0.282334 -0.154442 0.316840 0.036937 0.159102 0.045556 0.105301 -0.002820 0.133236 0.371916 -0.094278 -0.132697 0.001560 0.030920 -0.027174
polarizability: 1.98900735e+02 -5.15643141e+00 1.39128110e+02 -1.10154611e+01 -1.21663660e+01 1.14223482e+02
1716.lowfreq: -28.3532 -5.9208 -2.1334 -0.0008 -0.0006 -0.0005 8.7251 28.0631 36.6422
frequency: -28.1536 27.9079 36.6090 71.2241 89.6101 138.6220 176.0940 197.7243 217.9475 225.9112 234.0963 279.9966 347.8729 375.3910 400.2827 412.7073 446.4771 474.8008 502.8309 567.6894 572.5392 587.7785 610.3089 617.2102 674.0238 692.3452 732.4750 758.5012 776.3330 788.6703 821.4435 824.5443 852.1353 867.7661 891.0617 901.6801 933.1519 961.6598 968.3584 973.7421 981.4948 982.8860 986.6810 1022.7042 1026.6483 1052.5965 1081.0515 1083.7540 1091.5474 1105.5411 1121.8182 1144.2971 1167.4521 1172.8008 1179.6524 1197.4292 1216.8317 1225.8185 1243.1099 1255.3895 1276.7296 1314.5173 1317.1776 1323.0072 1336.1622 1338.3271 1374.8755 1390.0931 1391.2490 1443.5369 1451.8591 1458.6972 1468.7545 1474.1290 1482.6054 1490.5154 1498.6851 1592.3911 1611.2143 2971.6601 2980.0592 3001.8085 3007.5685 3011.2707 3042.2056 3059.0995 3070.4295 3075.2395 3087.6587 3115.9964 3120.7958 3128.7869 3137.6173 3155.0493 3163.4016 3172.6763
redmass: 4.0923 4.5236 4.0835 3.9184 5.4191 2.6958 2.8101 1.1734 3.0743 3.0859 3.5351 2.9077 3.4277 3.9994 2.3504 2.8963 3.5471 4.5981 2.8759 5.9835 6.3920 5.2930 6.3687 3.3089 3.5494 2.0975 5.3749 1.6334 3.3962 5.3161 2.5742 1.2988 2.2650 2.5132 1.4917 2.1501 2.1396 1.3740 4.1654 6.8585 3.4387 1.4007 6.6497 2.0521 2.4550 2.2008 1.6879 1.5202 1.7777 1.9029 1.7536 1.7340 1.0881 1.2268 1.1707 1.2832 3.2961 2.2430 1.5551 2.4770 1.5223 1.3330 1.2669 1.2261 1.3261 1.3316 1.7592 1.6749 2.2271 2.3391 1.0494 1.0483 1.2833 1.1207 1.6413 1.0861 1.0874 6.4150 6.2718 1.0669 1.0555 1.0608 1.0647 1.0353 1.1019 1.0996 1.0984 1.0960 1.1029 1.1001 1.1011 1.0847 1.0889 1.0924 1.0955 1.1008
irintensity: 1.2685 0.3484 1.0693 0.8798 1.1364 4.6894 2.9447 0.4105 1.1072 0.9938 0.3090 14.1754 2.0343 0.3829 0.7129 0.1591 3.4572 2.6224 11.9569 10.8122 33.7413 28.3919 0.2972 7.9023 1.2900 31.4895 2.7144 85.9004 56.7263 29.6892 60.5883 2.7498 2.3123 4.5080 4.1184 19.1187 12.2510 0.9956 36.1796 38.9222 56.1663 8.9077 35.5296 27.1071 17.2177 33.5503 30.8440 10.2299 30.0258 48.6857 14.9071 58.3351 8.4475 10.8848 40.2906 6.7523 235.2763 40.4512 16.1204 66.8029 23.1412 0.9121 4.1570 1.5227 8.8703 1.9181 3.0562 10.2803 37.5663 3.0988 6.3575 5.7290 83.0232 16.6192 41.1095 10.7569 8.5036 24.5227 82.4483 78.1507 23.1126 39.5655 49.1791 14.2826 13.0204 15.5863 51.9679 34.4948 41.5792 15.3591 19.1570 2.4796 11.0631 31.1940 21.1151 6.1698
temp: 298.150 k
press: 1.00000 atm
elementType: 8 8 8 7 6 6 6 6 6 6 6 6 6 6 6 6 6 1 1 1 1 1 1 1 1 1 1 1 1 1 1 1 1 1
symmnumber: 1
zpe: 733938.1 jmol-1
zpe.correction: 0.279542 hartree
zpe.thermalcorrener: 0.294145 hartree
zpe.thermalcorrenthalpy: 0.295089 hartree
zpe.thermalcorrgfe: 0.236910 hartree
zpe.sumelectzpe: -784.678849 hartree
zpe.sumelectthermal: -784.664246 hartree
zpe.sumelectthermalent: -784.663302 hartree
zpe.sumelectthermalfe: -784.721482 hartree
dipole: -0.8728 0.6772 2.4546
dipole: 2.6917
quadrupole: -99.1362 -97.3252 -102.2209
quadrupole: -1.4622 4.7998 0.3665
quadrupole: 0.4245 2.2356 -2.6601 -1.4622 4.7998 0.3665
hfenergy: -784.9583915 hartree
pointgroup: C01 [X(C13H17N1O3)]
dipole: -0.2136837 -1.0260792 -0.1515647 debye
polarizability: 194.2276072|23.3001191|113.9777391|-0.7182655|-1.6420313|144.0469816 unknown
InChI: InChI=1S/C13H17NO3/c1-13-14(7-8-16-13)9-12(17-13)10-15-11-5-3-2-4-6-11/h2-6,12H,7-10H2,1H3
charge 0 multiplicity 1
34 atoms
O  2.12263 1.746454 -0.203657
O  3.053619 0.227633 1.507321
O  -1.192183 0.212646 -0.884053
N  2.953966 -0.393117 -0.793865
C  3.173359 0.761981 0.111866
C  1.742373 -0.13742 -1.627557
C  1.042804 1.081684 -0.967204
C  3.032373 -1.636523 0.018746
C  2.62542 -1.187104 1.447504
C  4.508918 1.487962 0.029468
C  -0.117609 0.735771 -0.024403
C  -2.401478 -0.159147 -0.267827
C  -2.643127 -0.076046 1.125885
C  -3.405574 -0.642611 -1.143526
C  -3.899429 -0.484923 1.633132
C  -4.650682 -1.044972 -0.621712
C  -4.906243 -0.96989 0.770343
H  1.076481 -1.018011 -1.656421
H  2.037307 0.106472 -2.663299
H  0.686923 1.807538 -1.717271
H  4.070313 -2.016494 0.015841
H  2.376277 -2.41813 -0.39885
H  1.532482 -1.271338 1.615142
H  3.158437 -1.726525 2.247548
H  5.332966 0.784935 0.232055
H  4.637093 1.9254 -0.973476
H  4.5365 2.294057 0.781284
H  -0.451957 1.648334 0.505577
H  0.181259 -0.024468 0.72353
H  -1.879383 0.300644 1.812714
H  -3.19079 -0.690332 -2.215715
H  -4.086161 -0.419838 2.711083
H  -5.424667 -1.416469 -1.302625
H  -5.875411 -1.283052 1.172328
