program: Gaussian 09
title: 000291902
version: EM64L-G09RevD.01
frameworkgroup: C1[X(C11H16ClN)]
method: RPBEPBE
basis: SDD
operation: Freq
keyword: #p
keyword: freq=noraman
keyword: PBEPBE/SDD
title: #p freq=noraman PBEPBE/SDD
converged: YES YES NO NO
title: Mulliken charges:
elementType: Cl N C C C C C C C C C C C H H H H H H H H H H H H H H H H
charge: -0.077315 -0.233261 0.272572 -0.352392 -0.325511 0.345403 -0.306636 -0.671020 -0.674507 -0.375866 -0.811118 -0.108792 -0.254765 0.197808 0.205667 0.190538 0.215480 0.278870 0.215942 0.237213 0.210890 0.226332 0.207618 0.206170 0.232954 0.232339 0.226775 0.234512 0.254099
chargesum: 0.00000
title: Mulliken charges with hydrogens summed into heavy atoms:
elementType: Cl N C C C C C C C C C C C
charge: -0.077315 -0.233261 0.272572 0.051083 0.080507 0.345403 -0.027766 -0.006976 -0.034387 -0.142912 -0.117491 -0.108792 -0.000665
polarizability: 1.75614921e+02 -4.13319040e+00 1.42377565e+02 -1.48825748e+00 5.37654145e+00 9.14941596e+01
1716.lowfreq: -18.4349 -14.1540 -11.4648 -0.0027 -0.0020 -0.0016 6.9877 47.6426 60.8048
frequency: -16.1646 47.5366 60.7524 95.9966 120.6720 134.6584 148.5206 202.2404 219.2295 243.5530 258.6701 283.5547 293.8015 328.7391 353.2303 357.4062 393.5437 453.9563 484.4773 558.9979 595.1595 631.5641 699.1211 727.6655 776.0160 789.9490 802.3294 808.0909 887.5282 912.3101 932.4400 943.6495 985.2274 1031.7749 1042.2399 1070.9299 1073.0921 1079.0649 1100.8624 1115.2003 1153.3034 1191.5498 1202.1919 1245.1514 1262.3928 1293.0213 1307.0092 1348.8811 1355.3458 1357.4435 1383.1553 1385.2573 1397.7425 1404.1109 1458.9052 1461.4681 1465.3197 1466.3402 1472.2158 1478.0384 1480.3760 1484.5037 1491.7717 1564.0768 1593.9036 2879.3134 2898.4721 2977.5859 2977.7718 2982.3867 3028.7421 3037.1084 3057.5815 3071.3302 3077.7781 3089.1601 3091.3959 3093.2245 3126.3711 3172.1220 3179.5391
redmass: 2.5346 3.4011 2.7940 3.7584 3.7313 1.8489 1.0757 2.2768 1.9139 2.8765 1.6456 1.9777 2.1645 3.4171 3.7503 5.2457 3.0363 2.9908 3.0811 3.7079 4.4095 6.7030 4.5504 3.3555 1.6577 1.3010 1.7003 1.3036 1.4852 2.2940 1.9265 1.3803 1.5424 2.7013 1.5435 2.0974 2.1629 1.8895 1.8277 2.0095 1.4407 2.7005 2.8714 1.6496 1.4400 1.2203 1.3442 2.8383 1.8806 1.7062 1.2319 1.2184 1.2322 2.5473 1.3660 1.0636 1.1889 1.1092 1.1577 1.0709 1.1279 1.1399 1.1324 7.2328 6.5226 1.0713 1.0697 1.0391 1.0357 1.0356 1.0882 1.0915 1.0939 1.0982 1.0987 1.0997 1.1007 1.1008 1.0896 1.0952 1.0929
irintensity: 0.2833 1.0228 0.4983 0.2492 0.9587 2.1237 0.4487 1.2398 0.8288 0.6372 0.2882 1.7235 2.2987 3.2375 2.3341 6.9244 6.0682 9.5974 5.8543 6.6053 1.3019 18.2698 4.1293 2.5857 1.7960 7.8441 25.2838 37.4235 14.3068 25.5323 1.2663 0.2459 15.0327 35.8722 9.8955 17.9172 16.8352 2.5940 21.9958 30.5229 2.6697 44.7140 11.3253 27.7245 9.2648 9.7234 31.6437 10.4099 23.6993 5.6882 21.6508 17.4230 13.1683 8.7768 63.1538 9.0001 20.2234 6.5642 21.5290 7.6717 17.8627 18.8511 29.4410 23.0535 53.8375 71.5798 106.0441 36.1470 39.6403 28.0948 19.2033 15.3835 18.0799 55.1820 44.6439 21.5434 45.7875 41.4878 16.7039 5.1640 0.2938
temp: 298.150 k
press: 1.00000 atm
elementType: 17 7 6 6 6 6 6 6 6 6 6 6 6 1 1 1 1 1 1 1 1 1 1 1 1 1 1 1 1
symmnumber: 1
zpe: 636934.4 jmol-1
zpe.correction: 0.242595 hartree
zpe.thermalcorrener: 0.256350 hartree
zpe.thermalcorrenthalpy: 0.257294 hartree
zpe.thermalcorrgfe: 0.202018 hartree
zpe.sumelectzpe: -942.568351 hartree
zpe.sumelectthermal: -942.554596 hartree
zpe.sumelectthermalent: -942.553652 hartree
zpe.sumelectthermalfe: -942.608928 hartree
dipole: -2.9395 1.7522 0.6445
dipole: 3.4823
quadrupole: -87.2018 -81.4381 -87.6460
quadrupole: 3.9056 0.5123 -0.2078
quadrupole: -1.7732 3.9905 -2.2174 3.9056 0.5123 -0.2078
hfenergy: -942.810946 hartree
pointgroup: C01 [X(C11H16Cl1N1)]
dipole: 0.9667602 -0.9597372 -0.1459808 debye
polarizability: 170.4982438|-9.1166114|144.1247869|-12.0055398|11.9239569|94.8636146 unknown
InChI: InChI=1S/C11H16ClN/c1-4-13(5-2)11-8-10(12)7-6-9(11)3/h6-8H,4-5H2,1-3H3
charge 0 multiplicity 1
29 atoms
Cl -3.34345 2.249395 0.645579
N  1.417665 0.204594 -0.124432
C  0.010474 -0.072685 0.002709
C  2.223941 0.279166 1.120912
C  2.125952 -0.257148 -1.341826
C  -0.535188 -1.395426 -0.089879
C  -0.863159 1.026793 0.231517
C  1.860959 1.454403 2.050325
C  2.998909 0.853152 -1.964896
C  -1.939722 -1.558821 0.019828
C  0.351416 -2.615019 -0.278361
C  -2.244405 0.812348 0.358114
C  -2.811176 -0.470178 0.24582
H  2.154942 -0.672371 1.702064
H  3.280522 0.385498 0.812368
H  2.760119 -1.15253 -1.14082
H  1.363351 -0.566821 -2.079425
H  -0.439409 2.033049 0.274245
H  1.967423 2.417039 1.519212
H  0.823454 1.373704 2.418221
H  2.532041 1.46028 2.929814
H  2.374386 1.718917 -2.245613
H  3.771759 1.205615 -1.257259
H  3.515504 0.478235 -2.869204
H  -2.364546 -2.567239 -0.052713
H  1.284161 -2.529756 0.306074
H  -0.172553 -3.532252 0.040911
H  0.646155 -2.754194 -1.336202
H  -3.890622 -0.618247 0.338718
