program: Gaussian 09
title: 000291900
version: EM64L-G09RevD.01
frameworkgroup: C1[X(C8H14ClNO3)]
method: RPBEPBE
basis: SDD
operation: Freq
keyword: #p
keyword: freq=noraman
keyword: PBEPBE/SDD
title: #p freq=noraman PBEPBE/SDD
converged: NO YES NO NO
title: Mulliken charges:
elementType: Cl O O O N C C C C C C C C H H H H H H H H H H H H H H
charge: -0.055031 -0.298807 -0.237886 -0.255014 -0.226696 -0.307396 0.263060 -0.445375 -0.590433 0.290099 -0.679182 -0.247871 -0.662055 0.273032 0.261885 0.254714 0.255763 0.289438 0.279279 0.213715 0.228559 0.228183 0.238885 0.228819 0.223673 0.227459 0.249184
chargesum: 0.00000
title: Mulliken charges with hydrogens summed into heavy atoms:
elementType: Cl O O O N C C C C C C C C
charge: -0.055031 -0.298807 -0.237886 -0.255014 -0.226696 0.227522 0.263060 0.065102 -0.021716 0.290099 -0.008725 0.219833 0.038261
polarizability: 1.35868241e+02 -1.54688679e+00 1.30304303e+02 4.90437299e+00 2.46299897e+00 7.77328495e+01
1716.lowfreq: -6.0828 -5.1382 -0.0020 0.0008 0.0018 5.2104 24.2966 42.6450 48.5412
frequency: 23.7785 42.6200 48.5091 60.4230 82.0353 85.4723 110.7721 131.7968 158.7250 201.1851 211.0622 231.3053 264.0029 307.0326 327.8805 356.9676 396.6219 414.1562 453.1033 553.6066 591.7565 654.4390 697.0040 715.6058 753.3149 779.2756 796.4445 810.5487 821.0820 922.2874 996.8062 1015.3325 1030.4517 1056.7866 1066.1001 1081.0664 1095.2471 1104.4723 1133.4922 1154.6420 1192.7546 1248.5939 1263.8223 1266.9657 1278.9902 1328.3948 1347.8878 1359.7417 1376.1323 1390.2760 1397.7023 1415.1064 1451.2593 1454.7954 1457.3263 1463.5485 1469.7448 1477.8516 1482.4235 1614.3350 1635.4915 2993.8522 2999.1074 3008.6700 3035.2918 3049.3956 3064.4037 3074.5067 3088.8790 3096.0826 3096.3917 3103.8202 3122.8326 3136.0405 3161.8998
redmass: 3.3583 6.4333 4.1540 4.7337 3.0666 3.4801 1.8553 3.5650 3.2716 1.2196 1.4376 4.8815 2.5734 4.2671 3.8212 4.5965 4.8635 3.8655 3.8876 2.5075 6.4501 3.7486 7.4475 6.6868 2.8999 1.2340 1.4373 1.4887 2.7179 2.8218 2.6039 1.8358 1.8254 3.3058 3.8328 1.6482 2.2031 3.0123 1.7640 1.6767 4.2739 1.1626 1.6689 1.2927 1.1146 1.3705 1.5091 1.4347 1.3193 1.2354 1.2136 1.1066 1.0854 1.0950 1.0960 1.0446 1.0395 1.0512 1.0519 7.8411 9.9353 1.0361 1.0360 1.0630 1.0597 1.0972 1.0583 1.0568 1.0972 1.1029 1.1001 1.1000 1.1069 1.1063 1.1122
irintensity: 0.7570 1.0275 1.2094 0.1735 0.7245 1.8167 2.4355 2.7485 4.8152 0.1496 2.1014 1.2078 1.7941 9.8504 26.2903 9.0092 1.1470 3.9641 5.5409 1.6165 40.7878 3.2849 10.3764 22.7499 15.6116 10.7966 17.7698 1.7944 4.8006 28.6515 71.8985 32.0310 18.4002 176.8625 3.9061 0.1638 57.3326 29.4978 461.9139 0.9561 41.9403 0.3173 140.5032 53.6416 1.2340 31.2081 99.9852 65.8646 35.2801 24.9762 15.3600 33.3416 14.6907 23.2627 32.9476 15.2790 12.2085 13.4816 18.2140 76.0913 356.0078 15.7757 33.6496 6.6633 27.7566 1.3925 1.4401 18.8091 34.8169 1.9931 24.9800 30.4763 26.5917 1.0673 4.8942
temp: 298.150 k
press: 1.00000 atm
elementType: 17 8 8 8 7 6 6 6 6 6 6 6 6 1 1 1 1 1 1 1 1 1 1 1 1 1 1
symmnumber: 1
zpe: 569072.7 jmol-1
zpe.correction: 0.216748 hartree
zpe.thermalcorrener: 0.232242 hartree
zpe.thermalcorrenthalpy: 0.233186 hartree
zpe.thermalcorrgfe: 0.171444 hartree
zpe.sumelectzpe: -1052.718241 hartree
zpe.sumelectthermal: -1052.702748 hartree
zpe.sumelectthermalent: -1052.701803 hartree
zpe.sumelectthermalfe: -1052.763545 hartree
dipole: -0.5456 3.9775 0.1792
dipole: 4.0187
quadrupole: -87.1053 -91.4117 -81.7581
quadrupole: -8.0652 0.4788 -0.5543
quadrupole: -0.3470 -4.6533 5.0003 -8.0652 0.4788 -0.5543
hfenergy: -1052.9349894 hartree
pointgroup: C01 [X(C8H14Cl1N1O3)]
dipole: 1.0018331 -1.2035734 0.2181147 debye
polarizability: 135.2378709|0.4862492|127.4520396|-6.2301548|-13.0278368|81.2154832 unknown
InChI: InChI=1S/C8H14ClNO3/c1-3-7(11)10(6-5-9)8(12)13-4-2/h3-6H2,1-2H3
charge 0 multiplicity 1
27 atoms
Cl 1.135068 4.013167 -0.698077
O  1.864152 -0.429812 -0.668971
O  -2.475342 1.053525 -0.23495
O  0.370546 -2.044096 0.122312
N  -0.356698 0.144778 -0.477373
C  0.068318 1.462034 -1.043719
C  -1.749097 0.032754 -0.102748
C  -2.28598 -1.295057 0.415901
C  0.576598 2.383979 0.072711
C  0.593928 -0.884646 -0.302077
C  -3.792351 -1.220853 0.719413
C  2.976605 -1.421483 -0.516183
C  3.536552 -1.395607 0.907208
H  -0.814033 1.913045 -1.522595
H  0.858038 1.292003 -1.788432
H  -1.709438 -1.593163 1.311605
H  -2.060305 -2.088342 -0.320905
H  -0.216358 2.645854 0.787247
H  1.463689 1.975268 0.576656
H  -4.145729 -2.197884 1.094113
H  -4.370816 -0.960221 -0.183059
H  -4.01085 -0.452408 1.480168
H  2.591429 -2.420997 -0.781913
H  3.714978 -1.085033 -1.260993
H  4.413745 -2.065853 0.971024
H  3.862578 -0.378641 1.185883
H  2.784372 -1.746912 1.633154
