program: Gaussian 09
title: 000291908
version: EM64L-G09RevD.01
frameworkgroup: C1[X(C14H26O2)]
method: RPBEPBE
basis: SDD
operation: Freq
keyword: #pfreq=noraman
keyword: PBEPBE/SDD
title: #p freq=noraman PBEPBE/SDD
converged: NO YES NO NO
title: Mulliken charges:
elementType: O O C C C C C C C C C C C C C C H H H H H H H H H H H H H H H H H H H H H H H H H H
charge: -0.302479 -0.456878 -0.116653 -0.065952 -0.017950 -0.123673 -0.458465 -0.466532 -0.473611 -0.440532 -0.400956 -0.403606 -0.233738 -0.377844 -0.345447 -0.687958 0.205277 0.256617 0.182999 0.181785 0.180295 0.233809 0.242771 0.178166 0.206094 0.207580 0.178274 0.235939 0.184513 0.195685 0.196569 0.195114 0.329967 0.175366 0.175415 0.204021 0.203916 0.191683 0.191005 0.212124 0.212107 0.215183
chargesum: 0.00000
title: Mulliken charges with hydrogens summed into heavy atoms:
elementType: O O C C C C C C C C C C C C C C
charge: -0.302479 -0.126911 0.088623 0.190665 0.165049 0.058112 -0.044362 -0.045595 -0.059937 -0.026319 -0.020759 -0.011923 0.117044 0.030094 0.037240 -0.048544
polarizability: 1.72259860e+02 1.15514260e+00 1.53594897e+02 -3.24417424e+00 -3.84164203e-01 1.34506371e+02
1716.lowfreq: -32.9382 -3.3374 -0.0006 -0.0002 0.0006 8.6790 24.7966 36.8149 46.8947
frequency: 22.5858 34.9775 46.5596 82.8917 95.7925 100.5180 128.9317 135.2591 185.9098 220.0774 230.4113 233.9427 252.0114 275.1801 296.3470 315.4041 330.8345 381.7365 399.0500 407.5871 419.5583 454.0700 468.5076 490.3293 514.1479 574.0178 692.3759 741.2227 777.2939 805.2982 817.8037 827.7841 841.9269 850.9852 876.9147 890.5805 900.1257 918.5698 935.7723 947.2372 985.1253 996.5299 1000.7699 1019.9755 1043.5441 1048.8468 1055.6558 1058.3151 1081.3261 1087.8251 1096.0689 1111.5326 1120.8371 1129.5717 1136.2431 1146.5700 1163.5702 1178.4378 1210.9066 1217.8341 1221.6425 1235.2190 1255.9897 1267.0760 1272.9952 1277.1166 1282.7720 1285.5406 1293.9994 1300.2228 1307.6232 1316.2684 1328.2678 1333.5359 1337.7290 1339.9514 1346.8388 1348.5289 1349.7515 1357.2982 1387.6004 1391.2160 1394.7838 1458.7178 1463.9723 1464.3486 1464.7461 1470.1199 1470.7854 1474.4906 1476.9312 1477.7751 1484.1549 1492.5553 2896.5273 2905.8916 2911.0319 2927.0346 2949.4129 2954.2604 2957.5321 2964.9946 2967.8509 2968.9763 2972.4128 2974.5491 2981.1198 2990.2777 2991.0831 3007.8429 3019.9246 3028.9804 3032.2743 3043.6731 3049.3820 3052.8737 3056.9842 3072.9726 3073.6331 3555.4372
redmass: 3.7881 1.7650 3.6143 2.9417 2.8907 1.8891 3.2708 2.8371 3.2031 3.2411 3.0678 1.2286 3.0988 1.1897 1.7219 2.4823 2.5055 3.5611 3.2795 2.9306 3.5576 3.2322 2.6697 3.2013 1.8320 2.9418 3.1169 1.0741 1.9887 1.1762 1.8407 2.4845 2.4696 1.8495 1.8232 2.1118 1.8190 2.0376 1.1568 2.8041 1.8833 3.9149 2.7440 2.4644 2.7074 2.2010 1.8776 1.2490 2.1872 1.9597 1.7048 2.2988 2.4055 2.2532 1.9328 1.4873 1.3232 1.6833 1.3828 1.3194 1.3994 1.3435 1.3195 1.2576 1.1861 1.2699 1.0843 1.2962 1.2206 1.3524 1.2990 1.3063 1.4093 1.4530 1.4131 1.4759 1.5894 1.5523 1.4948 1.4488 1.2905 1.5813 1.3932 1.0933 1.0893 1.0883 1.0889 1.0726 1.0800 1.0674 1.0424 1.0934 1.0690 1.0904 1.0824 1.0620 1.0748 1.0814 1.0685 1.1037 1.0625 1.0588 1.0619 1.0625 1.0637 1.0364 1.0653 1.0608 1.0813 1.1005 1.0964 1.1007 1.0976 1.0996 1.0990 1.1039 1.0944 1.1010 1.0994 1.0660
irintensity: 0.0700 0.6061 0.0781 0.3281 0.3118 0.3439 2.1237 1.7364 1.0740 7.4686 3.5900 0.1813 4.1547 98.6877 24.4248 11.5511 3.5396 0.5927 3.4892 2.0872 3.1975 6.7533 2.7228 7.9433 1.5208 1.2052 3.0245 8.1434 2.1976 1.0432 6.3255 3.2586 15.6054 3.6597 11.8873 3.2125 6.1338 25.6284 1.2849 23.2314 1.0318 23.5407 85.4187 34.2139 33.2943 36.0107 26.5545 2.8401 7.1347 25.1049 3.8569 2.9136 5.9916 4.5372 2.7865 5.6529 9.5222 9.0119 0.3022 9.3864 7.8752 1.5289 6.3911 1.5775 1.2482 4.1647 0.1203 15.5141 0.8594 8.7462 3.8767 14.3740 2.8454 1.7506 2.0116 1.7601 0.8584 9.6988 1.3758 21.2398 10.8853 4.0117 2.7783 9.9537 15.0132 2.4335 6.0428 2.2669 17.9875 0.5890 12.1658 3.8012 8.0608 13.0071 45.3248 26.8096 69.5379 44.0916 28.7599 47.1406 32.2800 34.6801 39.9787 45.7658 61.4513 35.2097 60.3871 31.4958 38.8936 6.7113 67.4503 63.5647 34.0239 52.7712 57.8600 25.9563 40.3283 93.7013 53.5844 2.4260
temp: 298.150 k
press: 1.00000 atm
elementType: 8 8 6 6 6 6 6 6 6 6 6 6 6 6 6 6 1 1 1 1 1 1 1 1 1 1 1 1 1 1 1 1 1 1 1 1 1 1 1 1 1 1
symmnumber: 1
zpe: 990194.0 jmol-1
zpe.correction: 0.377145 hartree
zpe.thermalcorrener: 0.394613 hartree
zpe.thermalcorrenthalpy: 0.395557 hartree
zpe.thermalcorrgfe: 0.330950 hartree
zpe.sumelectzpe: -698.217964 hartree
zpe.sumelectthermal: -698.200496 hartree
zpe.sumelectthermalent: -698.199552 hartree
zpe.sumelectthermalfe: -698.264159 hartree
dipole: -1.3577 -1.3336 2.4800
dipole: 3.1261
quadrupole: -99.0569 -93.6725 -101.7191
quadrupole: -1.6221 3.2651 -1.4687
quadrupole: -0.9074 4.4770 -3.5696 -1.6221 3.2651 -1.4687
hfenergy: -698.595109 hartree
pointgroup: C01 [X(C14H26O2)]
dipole: -0.5780433 0.3455824 -1.0291121 debye
polarizability: 172.3155553|0.9219525|153.1955453|3.1849237|-2.528414|134.8500278 unknown
InChI: InChI=1S/C14H26O2/c1-2-3-10-16-14-9-8-13(15)11-6-4-5-7-12(11)14/h11-15H,2-10H2,1H3
charge 0 multiplicity 1
42 atoms
O  -1.088076 -0.085258 -0.22947
O  2.380599 2.613888 1.22053
C  1.25289 -0.401428 -0.828996
C  1.822411 0.412376 0.370742
C  -0.106803 0.154542 -1.310389
C  1.900173 1.908569 0.012423
C  1.176708 -1.909538 -0.488109
C  3.197203 -0.148176 0.807664
C  -0.007317 1.660047 -1.65327
C  0.53598 2.460777 -0.447769
C  2.545481 -2.466588 -0.033532
C  3.113512 -1.652014 1.153384
C  -2.487398 -0.03695 -0.668269
C  -3.362323 -0.480801 0.509253
C  -4.868635 -0.484659 0.159219
C  -5.750872 -0.917672 1.349942
H  1.95722 -0.278938 -1.684288
H  1.111823 0.316434 1.217597
H  -0.431637 -0.414192 -2.213339
H  2.641075 2.04359 -0.812781
H  0.810255 -2.471416 -1.37189
H  0.426908 -2.048932 0.313733
H  3.567548 0.436176 1.668479
H  3.92678 -0.003025 -0.0190
H  -0.994433 2.053323 -1.962402
H  0.667617 1.776097 -2.526443
H  0.628633 3.533717 -0.715989
H  -0.173858 2.383227 0.397409
H  3.263204 -2.422161 -0.879908
H  2.445608 -3.534097 0.244989
H  2.454291 -1.786497 2.035843
H  4.113364 -2.034155 1.438245
H  2.366181 3.588674 1.043234
H  -2.630086 -0.714684 -1.541719
H  -2.766453 0.992426 -0.987217
H  -3.17572 0.195208 1.366329
H  -3.044455 -1.492818 0.826806
H  -5.046137 -1.165302 -0.698635
H  -5.172808 0.527762 -0.1775
H  -5.483268 -1.935581 1.690252
H  -5.620487 -0.232756 2.20872
H  -6.822603 -0.921592 1.079019
