program: Gaussian 09
title: 000291901
version: EM64L-G09RevD.01
frameworkgroup: C1[X(C11H16ClN)]
method: RPBEPBE
basis: SDD
operation: Freq
keyword: #p
keyword: freq=noraman
keyword: PBEPBE/SDD
title: #p freq=noraman PBEPBE/SDD
converged: YES YES NO NO
title: Mulliken charges:
elementType: Cl N C C C C C C C C C C C H H H H H H H H H H H H H H H H
charge: -0.069911 -0.175428 0.524109 -0.346457 -0.387557 -0.285760 -0.334767 -0.710479 -0.681622 0.469422 -0.433896 -0.387668 -0.807861 0.188097 0.231064 0.223802 0.240733 0.243712 0.234262 0.218922 0.216235 0.229278 0.215872 0.219982 0.254044 0.227798 0.225077 0.227780 0.231218
chargesum: 0.00000
title: Mulliken charges with hydrogens summed into heavy atoms:
elementType: Cl N C C C C C C C C C C C
charge: -0.069911 -0.175428 0.524109 0.072704 0.076978 -0.285760 -0.091055 -0.041059 -0.016491 0.469422 -0.179852 -0.159870 -0.123786
polarizability: 1.89668147e+02 7.46384919e+00 1.39789604e+02 -2.25490931e+00 -1.79738330e+00 8.88535196e+01
1716.lowfreq: -39.6075 -7.6527 -4.5667 -0.0033 -0.0027 -0.0017 8.8710 50.3271 55.3795
frequency: -39.3878 50.2807 55.3769 74.5777 109.1670 149.0779 177.1783 184.5882 207.4467 230.0677 268.6099 289.1336 308.6611 319.7099 368.3617 397.4694 429.7564 468.7436 500.9859 523.8368 567.6699 663.4431 667.9471 716.8731 772.8027 803.2009 820.1168 835.3311 871.1495 897.4442 927.8438 944.8043 991.9871 1012.2558 1033.8519 1044.6634 1060.4799 1075.6908 1115.9117 1144.8110 1152.6486 1188.3396 1218.7944 1259.6198 1272.1376 1291.2754 1339.0707 1344.7793 1361.0288 1374.5218 1381.2925 1387.9580 1398.7458 1400.0238 1464.0071 1466.4816 1470.0598 1473.5114 1475.9736 1480.8118 1488.2407 1493.3622 1503.6426 1549.3728 1620.0858 2890.6546 2974.2644 2978.4174 2987.5175 3018.5700 3032.2258 3051.5519 3067.2891 3078.5650 3081.7667 3082.9110 3093.6561 3103.3069 3120.9936 3149.4210 3156.8518
redmass: 1.0296 3.4094 3.2764 2.5609 3.1947 1.9019 4.4175 2.1485 5.3500 1.0967 1.8386 3.3262 2.5310 3.1097 2.9001 5.4231 3.0649 3.6499 3.5278 4.4785 3.0143 4.2908 4.7592 3.6816 1.1796 1.3357 1.3078 3.9084 1.3414 2.9411 1.9062 1.3594 1.5090 2.4642 2.7304 1.5144 2.2063 2.1964 1.6568 1.5356 1.9685 2.2599 2.0371 1.8117 1.3808 1.2257 2.4216 1.2805 1.8750 1.6169 1.2290 1.2310 1.2276 3.9284 1.0562 1.0553 1.0641 1.1088 1.0596 1.0549 1.0873 1.5372 1.5959 5.2906 6.9317 1.0704 1.0376 1.0352 1.0356 1.0667 1.0894 1.0973 1.0989 1.0982 1.0984 1.0986 1.1009 1.0993 1.0887 1.0919 1.0942
irintensity: 0.3030 1.1862 0.5147 0.4125 1.2106 3.4339 0.7982 0.2991 0.7881 0.1126 0.7731 1.3196 0.4964 0.8956 0.7156 2.5228 15.7465 1.3949 2.6426 10.2938 11.0983 9.8961 2.1341 0.1283 10.3404 34.3831 18.1163 29.4220 8.5087 4.9492 3.2820 1.3006 19.0616 11.9964 32.9468 11.8859 27.0641 14.6374 8.8460 10.8179 22.0716 36.6736 10.2985 67.6197 31.8789 9.8776 7.8663 3.5756 2.8570 33.4081 22.7822 24.0667 5.8955 1.4545 22.1428 24.6752 15.0459 19.2041 3.4322 10.7631 22.1453 75.0931 85.7121 3.2880 21.7619 78.9816 53.1150 27.7391 28.4363 44.0880 11.6787 22.7468 18.7145 38.9442 52.5383 20.3005 34.4531 24.4886 17.9491 9.1983 10.9787
temp: 298.150 k
press: 1.00000 atm
elementType: 17 7 6 6 6 6 6 6 6 6 6 6 6 1 1 1 1 1 1 1 1 1 1 1 1 1 1 1 1
symmnumber: 1
zpe: 638836.1 jmol-1
zpe.correction: 0.243320 hartree
zpe.thermalcorrener: 0.257021 hartree
zpe.thermalcorrenthalpy: 0.257965 hartree
zpe.thermalcorrgfe: 0.202689 hartree
zpe.sumelectzpe: -942.573373 hartree
zpe.sumelectthermal: -942.559671 hartree
zpe.sumelectthermalent: -942.558727 hartree
zpe.sumelectthermalfe: -942.614003 hartree
dipole: 0.4370 -2.2129 0.7275
dipole: 2.3700
quadrupole: -74.8314 -85.0563 -88.7463
quadrupole: -0.2733 0.0003 1.9694
quadrupole: 8.0466 -2.1783 -5.8683 -0.2733 0.0003 1.9694
hfenergy: -942.8166925 hartree
pointgroup: C01 [X(C11H16Cl1N1)]
dipole: 0.1916745 0.8741566 -0.2617842 debye
polarizability: 186.4439755|-5.4829427|139.358669|18.9847143|-2.9267098|92.5086264 unknown
InChI: InChI=1S/C11H16ClN/c1-4-13(5-2)11-7-6-9(3)8-10(11)12/h6-8H,4-5H2,1-3H3
charge 0 multiplicity 1
29 atoms
Cl -0.224132 -2.776846 0.488196
N  1.391983 -0.048507 0.51068
C  0.014851 0.040269 0.172532
C  2.006247 1.132538 1.164148
C  2.285312 -0.843069 -0.377935
C  -0.844205 -1.095508 0.081906
C  -0.62573 1.300962 -0.043647
C  3.260105 0.772932 1.984282
C  2.797819 -0.06036 -1.612867
C  -2.819632 0.260563 -0.457923
C  -2.210314 -0.999783 -0.238951
C  -1.998342 1.409484 -0.336612
C  -4.295175 0.369787 -0.800768
H  2.269466 1.933833 0.433002
H  1.24812 1.558926 1.845981
H  3.13925 -1.212643 0.218006
H  1.733854 -1.734925 -0.712413
H  -0.018722 2.210447 0.002882
H  3.036004 -0.04177 2.694937
H  4.104066 0.457029 1.345644
H  3.591673 1.657448 2.558286
H  1.952708 0.312003 -2.219953
H  3.425566 0.803343 -1.326376
H  3.411618 -0.723591 -2.25032
H  -2.808854 -1.915343 -0.28745
H  -2.434465 2.404062 -0.491977
H  -4.801167 -0.608201 -0.726417
H  -4.816671 1.07128 -0.123266
H  -4.442836 0.743444 -1.832303
