program: Gaussian 09
title: 000291897
version: EM64L-G09RevD.01
frameworkgroup: C1[X(C8H14N2)]
method: RPBEPBE
basis: SDD
operation: Freq
keyword: #pfreq=noraman
keyword: PBEPBE/SDD
title: #p freq=noraman PBEPBE/SDD
converged: YES YES NO NO
title: Mulliken charges:
elementType: N N C C C C C C C C H H H H H H H H H H H H H H
charge: -0.577703 -0.021092 0.044328 -0.467189 -0.442413 -0.432853 -0.432943 -0.092489 -0.462134 -0.210178 0.179638 0.200725 0.224311 0.212224 0.244331 0.218231 0.207477 0.205111 0.218743 0.244831 0.209611 0.191794 0.278883 0.258754
chargesum: 0.00000
title: Mulliken charges with hydrogens summed into heavy atoms:
elementType: N N C C C C C C C C
charge: -0.040065 -0.021092 0.223966 -0.042153 0.014143 -0.007145 -0.009089 0.152342 -0.060729 -0.210178
polarizability: 1.01278988e+02 -4.02163637e-01 8.32637929e+01 -4.80744947e+00 -1.96096535e+00 8.97540679e+01
1716.lowfreq: -6.2840 -4.0582 0.0007 0.0010 0.0010 17.0162 63.5483 103.0678 143.9358
frequency: 63.4147 103.0341 143.9242 157.9847 211.6669 223.0136 248.9191 319.0405 341.6976 410.4580 430.5432 442.2547 509.3194 570.6175 608.8028 646.4770 783.9065 793.7118 796.1301 876.7570 912.8406 933.0879 939.0408 955.9934 1018.3773 1046.8606 1068.3816 1083.3653 1096.2246 1112.0979 1135.7572 1163.1128 1183.8531 1236.1137 1257.4853 1269.0508 1277.7028 1294.9105 1314.0409 1321.0889 1334.9320 1346.0278 1350.7124 1364.5808 1380.4401 1458.7280 1463.3124 1469.3527 1476.2004 1480.8058 1641.3029 2183.7880 2868.3766 2923.6607 2967.1302 2973.5871 2977.5830 2982.5183 2997.3583 3012.4683 3027.7673 3049.3376 3053.1877 3059.0602 3462.4150 3589.9106
redmass: 5.5068 2.9793 3.5728 3.1122 1.2890 2.2643 2.0705 2.3807 3.9355 2.2677 2.7578 2.9792 2.2752 5.0700 1.3634 2.9385 1.8533 2.9643 2.0895 1.9202 2.3905 1.7314 1.4045 2.1760 1.6016 2.1365 1.7885 1.5759 1.5368 2.2475 2.1933 1.5797 1.4032 1.4117 1.1972 1.4111 1.2001 1.3655 1.3309 1.3758 1.3849 1.4599 1.3993 1.5951 1.4021 1.0829 1.0848 1.0833 1.0845 1.0874 1.0944 12.5438 1.0710 1.0814 1.0607 1.0672 1.0678 1.0622 1.0776 1.0895 1.0986 1.1000 1.1011 1.0978 1.0451 1.0976
irintensity: 2.1445 2.3640 2.9537 2.7497 39.7616 6.4212 0.0635 2.0310 2.2004 5.2591 1.3765 1.5522 23.3905 0.5347 187.4532 4.3381 0.3622 1.1570 1.5417 4.1593 3.8872 2.3367 8.3708 6.9126 10.7448 1.4382 1.7255 2.0169 0.4365 12.7168 1.7406 7.8963 2.4570 0.9006 2.1924 4.9085 5.4905 0.8902 1.4185 1.9317 0.4089 0.4321 2.7079 1.4627 12.6968 6.4607 8.2166 16.7481 3.1846 8.8107 41.6960 13.3583 110.8455 22.5897 31.5358 13.1588 24.4592 16.7541 55.5302 22.6819 74.2976 32.3731 37.6257 33.9916 0.9045 0.9110
temp: 298.150 k
press: 1.00000 atm
elementType: 7 7 6 6 6 6 6 6 6 6 1 1 1 1 1 1 1 1 1 1 1 1 1 1
symmnumber: 1
zpe: 551452.2 jmol-1
zpe.correction: 0.210037 hartree
zpe.thermalcorrener: 0.220428 hartree
zpe.thermalcorrenthalpy: 0.221373 hartree
zpe.thermalcorrgfe: 0.174505 hartree
zpe.sumelectzpe: -421.943437 hartree
zpe.sumelectthermal: -421.933045 hartree
zpe.sumelectthermalent: -421.932101 hartree
zpe.sumelectthermalfe: -421.978969 hartree
dipole: 3.2826 1.7461 -3.1641
dipole: 4.8822
quadrupole: -62.9812 -62.6167 -63.8042
quadrupole: -1.1048 10.6081 1.0562
quadrupole: 0.1528 0.5173 -0.6702 -1.1048 10.6081 1.0562
hfenergy: -422.153474 hartree
pointgroup: C01 [X(C8H14N2)]
dipole: -1.3396662 -0.8227683 -1.1035862 debye
dipolederiv: -0.6348986 0.0455936 0.0168404 0.0729986 -0.6539054 0.1987807 0.0145276 0.2321039 -0.2849696 -0.3170459 -0.0189334 -0.0262731 -0.0463805 -0.2360104 -0.0192664 -0.1071557 -0.0289628 -0.2772207 0.002408 0.0312305 0.0640989 0.0318314 0.0607147 0.0612329 0.1425278 0.033014 0.1024658 -0.0007253 0.0348394 0.0448347 0.0171233 0.0558179 0.0244726 0.0606314 -0.007372 0.0881946 -0.0381175 0.00584 0.0561638 0.0478259 0.0051319 0.0309909 0.0363001 0.0535165 0.0735666 0.0973703 0.0268602 0.0209333 0.0629335 0.1397096 0.042536 -0.0379517 0.0061677 0.0798612 0.1241022 -0.0143143 0.0566764 -0.0836071 0.0878301 -0.0437313 0.0157306 -0.0189321 0.1210024 0.1364008 -0.0100211 -0.0486259 -0.0037296 0.1023247 -0.0079384 -0.0574112 -0.0086177 0.0952752 0.4978897 -0.1488948 0.0871147 -0.0738691 0.4337514 -0.0834242 0.0231858 -0.0949103 0.2095455 0.0377746 0.0399754 0.0704741 0.0811637 -0.0837829 0.0830482 0.190358 0.0973733 0.1093762 0.0069942 -0.0122097 -0.0573533 -0.0422109 -0.0053707 -0.0681138 -0.0888119 -0.0756009 -0.1611677 -0.0106124 -0.1273234 0.0277251 -0.0938279 -0.1528989 0.0504163 0.0200152 0.0425456 0.0669004 0.0375522 0.014575 -0.0477319 0.0014046 0.05208 -0.0908461 -0.0533739 -0.0389299 -0.114385 0.0455038 -0.0489601 -0.0321993 -0.0414849 0.0464327 -0.0375094 -0.0374652 -0.0827593 -0.1215139 0.034376 0.1092362 -0.0597969 0.089723 -0.0314116 0.0489346 -0.0453991 0.0602671 0.055045 -0.0790467 0.1246595 -0.0182585 0.1013218 -0.0583065 0.0488386 -0.0396826 0.080851 0.051824 0.022255 -0.0720628 -0.0733275 -0.0547763 0.0318692 -0.0583831 -0.0143371 -0.0891932 -0.135411 0.0054963 0.0032315 -0.0943515 0.0231107 0.0494913 -0.0982223 -0.0441833 -0.0526554 -0.14024 -0.0285536 -0.0950188 0.0541676 -0.0895114 -0.1259896 0.0680215 0.0294243 0.0301256 0.0696763 -0.0967736 0.0029662 0.0733014 0.0023014 0.067573 -0.0246118 0.0718408 -0.0252953 -0.0253942 0.0317553 -0.0100635 -0.0907538 0.012553 0.0118448 -0.1007039 -0.0604479 -0.0537448 -0.1019315 -0.0613894 -0.0368511 0.0204821 -0.031904 -0.2852999 0.1427309 0.0175184 0.087094 0.0099934 0.0257222 0.1183266 0.0558967 0.0271767 0.3129332 -0.0169155 0.075222 -0.0522432 0.0992865 0.1615626 0.0373189 -0.1000374 -0.0101663 0.1754713 -0.1503368 -0.1110623 -0.0938417 0.1302203 unknown
polarizability: 101.52847|-0.057396|83.9199751|4.5535303|2.666042|88.8484039 unknown
InChI: InChI=1S/C8H14N2/c9-5-7-1-2-8(6-10)4-3-7/h7-8H,1-5,9H2
charge 0 multiplicity 1
24 atoms
N  -3.591424 0.633007 0.1547
N  2.824312 0.698142 1.445883
C  -1.314875 -0.35133 -0.167474
C  -0.308703 -1.39255 0.383272
C  -0.616754 1.011247 -0.389847
C  0.924958 -1.539268 -0.536196
C  0.61007 0.883681 -1.31794
C  1.632612 -0.169803 -0.784681
C  -2.546313 -0.217407 0.759729
C  2.29321 0.311302 0.448974
H  -1.671441 -0.718675 -1.158032
H  -0.801206 -2.378719 0.496656
H  0.022259 -1.082038 1.395852
H  -0.293515 1.414688 0.592485
H  -1.347539 1.728745 -0.803647
H  1.644155 -2.263657 -0.111435
H  0.608329 -1.929429 -1.524314
H  0.287067 0.547959 -2.324086
H  1.109056 1.862256 -1.44367
H  2.432518 -0.311734 -1.53937
H  -2.225631 0.260154 1.706748
H  -2.902817 -1.243944 1.023917
H  -4.271245 1.013911 0.818192
H  -4.04698 0.214361 -0.662313
