program: Gaussian 09
title: 000291919
version: EM64L-G09RevD.01
frameworkgroup: C1[X(C13H10N4O6)]
method: RPBEPBE
basis: SDD
operation: Freq
keyword: #p
keyword: freq=noraman
keyword: PBEPBE/SDD
title: #p freq=noraman PBEPBE/SDD
converged: YES YES NO NO
title: Mulliken charges:
elementType: O O O O O O N N N N C C C C C C C C C C C C C H H H H H H H H H H
charge: -0.173697 -0.187100 -0.246503 -0.167287 -0.193764 -0.195618 -0.440935 0.024238 0.006564 0.014831 0.188490 0.278075 0.371575 0.438344 -0.561122 -0.550370 0.491855 -0.485663 0.489347 -0.426586 -0.424975 -0.180958 -0.807728 0.358360 0.343481 0.332499 0.260810 0.255506 0.241540 0.235881 0.252749 0.231125 0.227036
chargesum: 0.00000
title: Mulliken charges with hydrogens summed into heavy atoms:
elementType: O O O O O O N N N N C C C C C C C C C C C C C
charge: -0.173697 -0.187100 -0.246503 -0.167287 -0.193764 -0.195618 -0.082575 0.024238 0.006564 0.014831 0.188490 0.278075 0.371575 0.438344 -0.217642 -0.217872 0.491855 -0.224852 0.489347 -0.171080 -0.183435 0.054924 -0.096818
polarizability: 3.67212489e+02 -2.78094252e+00 2.35273993e+02 1.97854851e+01 -1.16073916e+01 1.12984528e+02
1716.lowfreq: -5.9829 -1.7247 -0.0003 0.0007 0.0007 3.5407 29.7642 31.2047 43.8575
frequency: 29.7495 31.1935 43.8553 57.5071 60.4891 68.1892 83.4718 96.8306 124.5524 146.3958 178.1711 189.1816 202.3882 211.5492 232.8357 271.0849 312.8502 319.3298 334.7114 361.9620 375.1952 409.1646 436.9648 444.8834 502.6712 511.9657 518.9372 532.3623 546.0279 584.0014 640.9171 650.5468 673.9485 677.8418 689.7832 698.8516 701.1865 732.1066 738.0380 752.2592 790.5026 815.9327 834.9552 873.6251 884.6197 901.0228 917.9529 946.0149 963.7803 977.0511 985.8067 989.1083 1014.1577 1050.9132 1071.3832 1099.7325 1132.5706 1159.1524 1161.2950 1178.3103 1183.7778 1197.0090 1223.8948 1258.3697 1298.2765 1314.8984 1343.2499 1353.0704 1373.4126 1379.7852 1384.6841 1400.2345 1434.0385 1443.9096 1471.4908 1473.9595 1482.2236 1489.4477 1531.5886 1581.8940 1593.2377 1610.8882 1621.8066 2981.2325 3062.3578 3092.4387 3127.8559 3135.4052 3147.9665 3168.2474 3182.2527 3185.9355 3202.6586
redmass: 8.0782 4.5399 6.8724 7.7647 11.2749 1.0796 9.2036 10.3458 8.0712 12.2780 11.5444 6.5437 5.9639 3.0646 6.1919 5.7336 6.8950 12.1643 6.1662 6.3038 10.4985 5.0545 3.0089 5.0400 5.8332 5.9312 7.3668 5.6372 4.0341 5.6447 10.0069 8.4149 9.5009 7.1941 2.4621 6.6957 7.0398 6.0004 12.6581 4.5322 1.6396 4.5708 1.3748 2.8839 1.8372 5.5105 1.5636 2.3812 1.4793 1.3959 1.5166 4.1285 1.6392 1.5720 1.7195 1.5950 7.9194 1.8507 6.2868 1.9384 1.0916 10.4585 8.7374 3.3923 1.7994 1.6306 4.7373 4.7274 12.5668 9.4128 7.0251 1.2444 3.1878 5.3491 1.1895 1.4932 1.5211 3.9498 3.2680 3.4309 5.8025 6.2232 6.2812 1.0380 1.0967 1.0993 1.0917 1.0875 1.0920 1.0998 1.0925 1.0921 1.0781
irintensity: 0.1652 0.0657 0.4216 0.8934 0.1370 0.8121 0.5346 5.1152 6.1660 1.6671 4.8029 0.3998 0.8093 2.2271 1.4618 0.7836 0.8159 0.3879 0.3876 0.4874 0.6604 1.9633 4.5543 4.5213 7.6255 8.3015 2.9195 8.1604 5.6791 2.6629 7.9793 8.0678 19.1896 16.8584 11.1718 12.7133 5.3533 6.9770 4.2561 12.9952 21.6326 11.0457 85.7460 8.8916 17.2447 9.1202 8.1417 0.4640 16.9359 17.9839 0.5623 3.6616 0.3416 9.7475 48.1991 20.2005 84.9111 4.2195 368.5218 28.0350 1.5673 400.3344 297.4132 17.7596 49.4213 36.5822 111.8979 123.8429 25.0653 70.2561 9.3978 13.1227 6.7181 3.6275 14.1981 13.4577 15.5593 104.3232 34.6934 159.4004 40.4512 97.0507 185.8555 19.6885 15.5088 17.6908 4.8170 3.8875 13.4336 19.2966 18.0827 22.9854 144.9279
temp: 298.150 k
press: 1.00000 atm
elementType: 8 8 8 8 8 8 7 7 7 7 6 6 6 6 6 6 6 6 6 6 6 6 6 1 1 1 1 1 1 1 1 1 1
symmnumber: 1
zpe: 590078.0 jmol-1
zpe.correction: 0.224749 hartree
zpe.thermalcorrener: 0.244803 hartree
zpe.thermalcorrenthalpy: 0.245747 hartree
zpe.thermalcorrgfe: 0.174007 hartree
zpe.sumelectzpe: -1169.851409 hartree
zpe.sumelectthermal: -1169.831355 hartree
zpe.sumelectthermalent: -1169.830411 hartree
zpe.sumelectthermalfe: -1169.902151 hartree
dipole: -5.9190 0.7818 0.9314
dipole: 6.0426
quadrupole: -139.6784 -152.0004 -131.1292
quadrupole: 0.9848 -8.3685 -8.1562
quadrupole: 1.2576 -11.0644 9.8068 0.9848 -8.3685 -8.1562
hfenergy: -1170.076158 hartree
pointgroup: C01 [X(C13H10N4O6)]
dipole: 2.3569966 0.0459615 -0.30694 debye
polarizability: 361.1138334|-37.5146357|186.4747035|11.1374309|61.6802542|167.8824733 unknown
InChI: InChI=1S/C13H10N4O6/c1-8-3-2-4-9(5-8)14-13-11(16(20)21)6-10(15(18)19)7-12(13)17(22)23/h2-7,14H,1H3
charge 0 multiplicity 1
33 atoms
O  -2.025735 3.521049 1.816525
O  0.093753 -2.651343 -1.185008
O  0.12152 2.864091 2.184254
O  0.952133 -2.157709 0.875736
O  -5.219011 0.798121 -0.439691
O  -4.599256 -1.18495 -1.397581
N  1.050148 0.796014 0.896439
N  -1.073445 2.66991 1.673555
N  0.185487 -1.912078 -0.130886
N  -4.347664 -0.112037 -0.722053
C  -0.251168 0.494551 0.608042
C  -1.322347 1.434552 0.919326
C  -0.692593 -0.72112 -0.045992
C  2.252325 0.255097 0.3378
C  -2.646108 1.232929 0.492495
C  -1.997491 -0.908133 -0.503271
C  -2.966524 0.085335 -0.245786
C  2.347734 -0.054484 -1.040794
C  3.563631 -0.528076 -1.589059
C  3.384644 0.143261 1.181237
C  4.690107 -0.649556 -0.734767
C  4.601256 -0.309901 0.634696
C  3.645076 -0.902873 -3.057154
H  1.134604 1.612628 1.536858
H  -3.412189 1.976785 0.727216
H  -2.27698 -1.832479 -1.016677
H  1.484146 0.091128 -1.700926
H  3.300882 0.383104 2.246371
H  5.64031 -1.008228 -1.146188
H  5.480937 -0.406434 1.279449
H  3.125301 -1.862085 -3.243685
H  3.165035 -0.142372 -3.699115
H  4.690781 -1.018295 -3.388469
