program: Gaussian 09
title: 000291898
version: EM64L-G09RevD.01
frameworkgroup: C1[X(C12H20)]
method: RPBEPBE
basis: SDD
operation: Freq
keyword: #p
keyword: freq=noraman
keyword: PBEPBE/SDD
title: #p freq=noraman PBEPBE/SDD
converged: YES YES NO NO
title: Mulliken charges:
elementType: C C C C C C C C C C C C H H H H H H H H H H H H H H H H H H H H
charge: 0.302895 0.158927 -0.238407 -0.194721 0.214896 0.187273 -0.807144 -0.807880 -0.758795 -0.762045 -0.832631 -0.835809 0.217277 0.194459 0.213464 0.207558 0.213104 0.217050 0.208027 0.219087 0.229356 0.212122 0.211349 0.213966 0.243564 0.214754 0.231030 0.219757 0.231471 0.221402 0.230181 0.224464
chargesum: 0.00000
title: Mulliken charges with hydrogens summed into heavy atoms:
elementType: C C C C C C C C C C C C
charge: 0.302895 0.158927 -0.021131 -0.000262 0.214896 0.187273 -0.173018 -0.163716 -0.105968 -0.089761 -0.150373 -0.159762
polarizability: 1.30177549e+02 5.80767718e+00 1.35737022e+02 2.18050872e+00 3.22737599e+00 1.08907081e+02
1716.lowfreq: -18.8737 -13.6462 -0.0007 -0.0006 -0.0005 16.6360 101.5535 121.3052 132.5384
frequency: 101.4404 121.2988 132.5318 150.0843 153.3535 164.0329 177.0629 186.9860 206.6682 221.0175 227.6901 243.4953 258.3491 279.5391 302.2051 337.3058 353.4180 460.1888 487.9410 504.1726 532.0085 558.9022 611.6339 657.4055 703.8311 715.6758 778.0261 841.0498 914.1837 947.8229 958.9278 990.3197 1019.6471 1025.5288 1044.2136 1052.7672 1067.0926 1068.7523 1083.9127 1092.4942 1106.4226 1129.5779 1139.2934 1165.8289 1204.6443 1238.9200 1299.8269 1307.5726 1321.3916 1334.7004 1380.4299 1384.5886 1385.9252 1391.9718 1394.8218 1403.9427 1421.1546 1460.2287 1461.6309 1463.4306 1465.1729 1470.2993 1472.9736 1473.4285 1474.4343 1480.5554 1482.7952 1486.5673 1488.2763 1679.5353 2898.1572 2954.3157 2957.9773 2960.0756 2964.0391 2968.4099 2980.2189 3019.0756 3028.5786 3039.3266 3045.9308 3047.6479 3053.6092 3059.3035 3062.4130 3066.5858 3075.3099 3079.2957 3081.5654 3091.9695
redmass: 2.5643 2.7053 1.0255 1.1192 1.1956 1.3565 1.1600 1.5432 2.1646 1.9584 1.7355 1.1778 2.3702 2.5450 2.5578 2.8055 2.7708 2.9084 3.3850 3.9346 3.7046 3.6423 2.7670 2.9689 2.7572 3.0833 2.3201 1.9603 1.5993 1.3947 1.2238 1.2868 1.3185 1.7125 1.5891 1.7062 1.6249 1.6639 1.9034 2.0432 1.8978 2.9314 3.1125 3.9927 1.6579 2.8119 1.6341 1.6836 2.6613 2.9549 1.2197 1.2282 1.2577 1.3309 1.2538 1.2283 2.7151 1.0477 1.0496 1.0475 1.0496 1.0560 1.0633 1.0491 1.0548 1.0764 1.0575 1.0823 1.0487 7.4943 1.0813 1.0387 1.0363 1.0386 1.0365 1.0363 1.0362 1.0964 1.0958 1.0984 1.0987 1.0983 1.0890 1.0980 1.0988 1.0968 1.0966 1.0954 1.0970 1.0984
irintensity: 0.0252 0.3039 0.5620 0.1658 0.1631 1.1950 0.1103 0.4243 0.4076 0.1635 0.5532 0.5830 0.7751 1.3173 0.5711 0.0663 2.4234 2.2940 3.1079 0.4536 0.9215 0.7018 0.8359 3.1990 0.9499 7.9295 1.3760 1.5342 1.4983 1.1314 14.4437 8.2877 14.9758 4.9698 2.5633 2.7990 7.2705 1.8205 8.2934 2.7964 1.7765 2.9657 2.3033 3.0383 3.0316 0.9796 1.8989 2.1233 0.2709 1.0409 5.4927 14.5804 9.1359 8.9482 20.0853 12.1455 0.8076 5.3876 8.7788 18.7905 2.4082 12.1652 5.8945 23.0439 6.3489 12.7228 1.8353 4.1153 5.4705 0.7033 46.0400 55.9442 50.0803 32.9515 71.6731 35.6913 42.9301 23.1848 25.4567 30.1696 28.4155 42.5737 5.1934 22.4444 38.1833 45.8152 22.4476 35.0014 61.2229 26.5527
temp: 298.150 k
press: 1.00000 atm
elementType: 6 6 6 6 6 6 6 6 6 6 6 6 1 1 1 1 1 1 1 1 1 1 1 1 1 1 1 1 1 1 1 1
symmnumber: 1
zpe: 744897.4 jmol-1
zpe.correction: 0.283716 hartree
zpe.thermalcorrener: 0.298340 hartree
zpe.thermalcorrenthalpy: 0.299284 hartree
zpe.thermalcorrgfe: 0.244655 hartree
zpe.sumelectzpe: -468.288104 hartree
zpe.sumelectthermal: -468.273481 hartree
zpe.sumelectthermalent: -468.272537 hartree
zpe.sumelectthermalfe: -468.327165 hartree
dipole: -0.0550 0.0455 -0.0848
dipole: 0.1108
quadrupole: -73.7650 -74.7628 -76.5934
quadrupole: 0.1323 0.1985 0.7182
quadrupole: 1.2754 0.2776 -1.5530 0.1323 0.1985 0.7182
hfenergy: -468.5718206 hartree
pointgroup: C01 [X(C12H20)]
dipole: 0.02612 -0.0156511 -0.0312023 debye
polarizability: 129.1219125|5.3085691|136.8959138|-0.2224747|-3.2857468|108.8038248 unknown
InChI: InChI=1S/C12H20/c1-7-8(2)11(5)10(4)12(11,6)9(7)3/h8,10H,1-6H3
charge 0 multiplicity 1
32 atoms
C  -0.979014 0.621548 -0.400911
C  -0.753967 -0.901674 -0.171109
C  -1.363575 -0.015562 0.95878
C  0.419823 1.258186 -0.57837
C  0.750194 -1.071456 -0.089732
C  1.403533 0.119091 -0.266087
C  -2.085779 1.179151 -1.284021
C  -1.586455 -2.002964 -0.811251
C  -0.70567 0.228446 2.310541
C  0.647164 2.574863 0.205798
C  1.355099 -2.422174 0.209402
C  2.88819 0.382942 -0.224536
H  -2.453984 -0.148228 1.041621
H  0.531921 1.511086 -1.659536
H  -1.816668 1.115781 -2.356687
H  -3.039837 0.638527 -1.144428
H  -2.278023 2.244842 -1.049949
H  -1.528629 -2.941595 -0.227026
H  -2.653016 -1.7183 -0.86679
H  -1.244274 -2.226276 -1.840377
H  0.395481 0.23354 2.235793
H  -1.024147 1.195419 2.744423
H  -0.992004 -0.567283 3.025126
H  -0.115647 3.325635 -0.072275
H  0.58624 2.417174 1.29559
H  1.63862 3.008747 -0.022686
H  1.016275 -2.800031 1.195206
H  2.458133 -2.394006 0.221177
H  1.046674 -3.177595 -0.539457
H  3.475628 -0.539633 -0.07816
H  3.156131 1.082675 0.592313
H  3.232986 0.856123 -1.166379
