program: Gaussian 09
title: 000291896
version: EM64L-G09RevD.01
frameworkgroup: C1[X(C12H18)]
method: RPBEPBE
basis: SDD
operation: Freq
keyword: #p
keyword: freq=noraman
keyword: PBEPBE/SDD
title: #p freq=noraman PBEPBE/SDD
converged: YES YES NO NO
title: Mulliken charges:
elementType: C C C C C C C C C C C C H H H H H H H H H H H H H H H H H H
charge: 0.024719 0.205626 0.205301 0.134271 0.134483 -0.822804 -0.106927 -0.835408 -0.835478 -0.797946 -0.798104 -0.592775 0.236772 0.223090 0.222914 0.245211 0.229534 0.220377 0.243662 0.229530 0.243487 0.220333 0.221978 0.225205 0.223157 0.223118 0.225238 0.221959 0.207700 0.221778
chargesum: 0.00000
title: Mulliken charges with hydrogens summed into heavy atoms:
elementType: C C C C C C C C C C C C
charge: 0.024719 0.205626 0.205301 0.134271 0.134483 -0.140028 0.138284 -0.141835 -0.142128 -0.127606 -0.127789 -0.163297
polarizability: 1.69285781e+02 5.32446208e-03 1.27373604e+02 7.87099770e-01 2.48024819e-02 9.40542049e+01
1716.lowfreq: -12.9060 -12.5184 -0.0004 0.0002 0.0006 10.4532 69.3345 72.5877 97.7852
frequency: 69.3343 72.5841 97.7655 127.1151 131.5130 143.0934 161.4033 174.9164 205.2887 239.2778 265.4351 269.5344 276.1279 285.4646 298.8814 338.1939 396.3132 405.7121 500.5618 541.3596 545.6596 582.0262 617.0115 636.7360 678.9379 770.4090 810.7452 900.4618 922.3551 936.3587 954.2515 1001.7295 1006.6405 1017.1926 1027.5822 1045.4078 1048.9241 1071.2336 1079.5860 1094.8040 1138.9363 1145.2564 1173.6076 1248.0703 1294.5201 1295.3538 1349.4166 1377.3983 1389.4675 1395.2980 1399.7267 1405.1925 1415.2186 1458.7069 1460.3664 1461.8715 1463.4967 1470.4845 1471.2048 1472.8256 1477.8262 1479.5091 1487.0499 1620.1870 1637.1777 1665.6363 2954.0222 2955.4481 2963.7980 2966.4988 2978.8004 3021.1670 3022.5432 3032.2406 3035.0369 3069.9487 3072.8932 3073.3622 3080.4110 3081.2999 3083.3991 3083.6149 3098.9268 3195.1111
redmass: 3.1723 2.8957 1.1785 1.7033 1.0503 1.1438 1.0564 2.4402 1.9573 2.5543 1.2247 2.5730 1.7535 2.5158 2.4277 3.3119 3.2110 3.0957 2.8222 4.2902 2.6211 3.4264 3.0747 2.6530 2.1834 2.5865 2.3566 1.7157 1.3417 1.5912 1.4389 1.6717 1.1304 1.3954 1.4305 1.5271 1.6420 1.8304 1.7533 1.7964 3.4739 3.2245 3.9795 3.8245 4.3455 1.3386 4.0034 1.2074 1.3444 1.3645 1.2252 1.2392 1.1937 1.0494 1.0485 1.0481 1.0567 1.0621 1.0588 1.0455 1.0622 1.0762 1.0670 6.7346 4.5643 7.3639 1.0391 1.0391 1.0385 1.0379 1.0347 1.0950 1.0949 1.0967 1.0968 1.0990 1.0967 1.0972 1.0807 1.0962 1.0924 1.0960 1.0780 1.1142
irintensity: 0.1033 0.0110 0.0145 0.0055 2.2971 0.0425 0.0142 3.1634 0.0262 0.9934 0.0227 3.2701 0.2029 0.7160 0.7489 5.5312 0.2220 0.0995 0.2679 0.0237 4.8776 9.8579 2.3074 1.9496 8.3813 9.0040 0.0156 0.5542 65.2620 2.4274 0.8332 10.0292 13.6784 1.3330 0.6660 0.1883 0.5881 9.2393 44.7294 1.6460 0.8120 4.2541 0.1029 2.4066 0.6630 0.3549 0.7312 10.6789 1.4986 9.5574 26.0563 7.0367 2.6399 5.2221 21.9810 2.1558 12.8512 9.2689 0.1574 31.3616 17.8241 0.2357 0.0284 2.6099 46.1629 9.7373 76.4630 22.3618 10.3091 78.8355 28.4581 2.3756 36.0441 0.7717 48.3788 33.4501 29.5384 5.1264 14.2878 60.4783 25.4673 0.7055 6.7922 23.7009
temp: 298.150 k
press: 1.00000 atm
elementType: 6 6 6 6 6 6 6 6 6 6 6 6 1 1 1 1 1 1 1 1 1 1 1 1 1 1 1 1 1 1
symmnumber: 1
zpe: 682889.8 jmol-1
zpe.correction: 0.260099 hartree
zpe.thermalcorrener: 0.274825 hartree
zpe.thermalcorrenthalpy: 0.275769 hartree
zpe.thermalcorrgfe: 0.219940 hartree
zpe.sumelectzpe: -467.113537 hartree
zpe.sumelectthermal: -467.098811 hartree
zpe.sumelectthermalent: -467.097866 hartree
zpe.sumelectthermalfe: -467.153695 hartree
dipole: -0.5857 0.0005 0.2107
dipole: 0.6225
quadrupole: -71.3786 -73.3087 -74.6872
quadrupole: 0.0112 1.3182 0.0118
quadrupole: 1.7462 -0.1839 -1.5624 0.0112 1.3182 0.0118
hfenergy: -467.3736358 hartree
pointgroup: C01 [X(C12H18)]
dipole: -0.231901 -0.0199256 0.0761631 debye
polarizability: 168.7705626|4.1081541|127.7509065|3.0364476|-0.7063932|94.1921206 unknown
InChI: InChI=1S/C12H18/c1-7-12(6)10(4)8(2)9(3)11(12)5/h7H,1H2,2-6H3
charge 0 multiplicity 1
30 atoms
C  0.850192 0.076565 0.269825
C  -0.21021 1.183236 0.098584
C  0.015135 -1.216214 0.171732
C  -1.441025 0.599771 -0.102614
C  -1.301644 -0.885219 -0.057235
C  1.584968 0.186182 1.627702
C  1.78057 0.127488 -0.943768
C  0.152966 2.642767 0.149985
C  0.643642 -2.576916 0.306648
C  -2.766478 1.287199 -0.328278
C  -2.474599 -1.820023 -0.231356
C  3.131282 0.263727 -0.93656
H  0.855168 0.143273 2.455276
H  2.306835 -0.640577 1.759305
H  2.140891 1.138421 1.706012
H  1.252812 0.041774 -1.906144
H  0.472664 2.948778 1.167202
H  -0.693812 3.290138 -0.136774
H  0.999951 2.86865 -0.526792
H  1.019451 -2.753867 1.33519
H  1.514772 -2.684114 -0.368863
H  -0.069114 -3.386935 0.07375
H  -2.661274 2.384759 -0.360935
H  -3.489705 1.043108 0.474634
H  -3.230561 0.96396 -1.280578
H  -2.987566 -1.648413 -1.197934
H  -3.233968 -1.666883 0.560709
H  -2.166123 -2.87857 -0.198077
H  3.702612 0.288961 -1.871612
H  3.706667 0.353074 -0.008037
