program: Gaussian 09
title: 000291895
version: EM64L-G09RevD.01
frameworkgroup: C1[X(C7H16N2O)]
method: RPBEPBE
basis: SDD
operation: Freq
keyword: #p
keyword: freq=noraman
keyword: PBEPBE/SDD
title: #p freq=noraman PBEPBE/SDD
converged: YES YES NO NO
title: Mulliken charges:
elementType: O N N C C C C C C C H H H H H H H H H H H H H H H H
charge: -0.309500 -0.414810 -0.654686 0.019539 -0.441226 -0.384587 -0.349832 -0.719957 -0.695187 0.265226 0.248113 0.190600 0.202658 0.195948 0.236312 0.204104 0.208138 0.277989 0.221711 0.222794 0.208615 0.210190 0.218908 0.205022 0.296588 0.337331
chargesum: 0.00000
title: Mulliken charges with hydrogens summed into heavy atoms:
elementType: O N N C C C C C C C
charge: -0.309500 -0.136821 -0.020767 0.267652 -0.047969 0.047673 0.062411 -0.066838 -0.061067 0.265226
polarizability: 1.02378194e+02 -6.30273833e+00 9.02864182e+01 7.32024976e-01 3.00345305e+00 8.65883964e+01
1716.lowfreq: -3.1184 -0.0007 0.0004 0.0005 9.3832 16.3443 28.9528 63.0220 75.4968
frequency: 28.1550 62.9776 75.4719 83.9108 102.8963 150.1859 202.1825 227.9823 232.1257 240.2735 269.4415 304.4223 339.9580 437.1053 460.4961 469.9240 512.3189 583.6327 619.7240 717.2134 736.6156 777.5287 834.3363 866.3491 892.0762 934.4478 979.1881 1027.8991 1030.4073 1039.3895 1054.6563 1082.4363 1115.3407 1156.0383 1171.8598 1225.2349 1255.2516 1274.0521 1281.5342 1297.8630 1311.6976 1347.3283 1355.1017 1369.0859 1388.9258 1390.1421 1460.4109 1465.9370 1473.9041 1477.5063 1481.7095 1485.0262 1486.0888 1493.0322 1598.2451 1646.1925 2954.3502 2970.0214 2975.1840 2977.1892 2980.6626 3005.6599 3020.0628 3034.9832 3038.9539 3066.4574 3068.3784 3071.3531 3075.2933 3539.3134 3548.5984 3700.7273
redmass: 5.3887 3.2059 2.0077 2.3110 2.2956 2.2675 2.1275 1.2478 1.0944 1.5390 2.7304 2.8094 2.5276 1.6645 1.5846 2.7205 1.2005 2.7584 4.4175 8.4934 1.1185 1.2347 1.5407 2.7141 1.7480 1.8240 2.1450 1.4705 1.8804 1.6538 2.3479 2.4082 2.2868 2.0652 2.6718 1.4270 1.2087 1.2104 1.3385 1.2474 1.4906 1.5015 1.7478 1.3518 1.2306 1.2257 1.1545 1.0798 1.0666 1.0445 1.1990 1.0543 1.1258 1.5358 1.3650 3.4264 1.0626 1.0360 1.0366 1.0603 1.0622 1.0929 1.0889 1.0992 1.0995 1.1008 1.0993 1.0991 1.0995 1.0538 1.0683 1.1038
irintensity: 9.4422 8.6351 3.7182 0.1191 2.1966 4.6492 7.8676 0.5651 8.5780 0.6769 0.7396 0.3853 1.4636 222.9979 198.7963 19.0162 23.2083 2.6677 1.4865 15.8885 8.1920 16.8691 1.3192 11.9245 7.2129 3.2441 1.0344 2.1733 11.0857 5.6186 1.2715 1.7048 13.8228 9.2256 17.1554 0.6343 4.4900 17.2034 19.5315 49.1192 3.9624 11.0133 28.8354 16.5179 16.6894 18.0778 69.6621 12.7842 16.6931 13.5810 81.6152 22.5407 52.3058 234.4065 107.7162 274.2826 17.7981 43.3599 30.7516 42.4661 25.5815 3.6558 8.2079 19.0013 14.0894 65.3288 81.2326 56.5514 54.1500 30.9231 7.3187 33.5527
temp: 298.150 k
press: 1.00000 atm
elementType: 8 7 7 6 6 6 6 6 6 6 1 1 1 1 1 1 1 1 1 1 1 1 1 1 1 1
symmnumber: 1
zpe: 600587.7 jmol-1
zpe.correction: 0.228752 hartree
zpe.thermalcorrener: 0.241786 hartree
zpe.thermalcorrenthalpy: 0.242730 hartree
zpe.thermalcorrgfe: 0.188681 hartree
zpe.sumelectzpe: -460.266874 hartree
zpe.sumelectthermal: -460.253839 hartree
zpe.sumelectthermalent: -460.252895 hartree
zpe.sumelectthermalfe: -460.306945 hartree
dipole: -1.4159 -0.0940 -3.9979
dipole: 4.2423
quadrupole: -64.3127 -61.2873 -62.1825
quadrupole: -3.0696 -10.0779 5.7479
quadrupole: -1.7185 1.3069 0.4116 -3.0696 -10.0779 5.7479
hfenergy: -460.4956253 hartree
pointgroup: C01 [X(C7H16N2O1)]
dipole: 0.6227617 -0.0208961 1.5483625 debye
dipolederiv: -0.7242134 -0.1573813 -0.1787198 -0.1645173 -0.4972159 0.0409936 -0.2418951 0.0014184 -0.9788921 -1.2767741 -0.3977187 0.0241815 -0.242702 -0.7941288 0.0408583 -0.1672632 -0.0158133 -0.273974 -0.7935322 -0.1345252 0.4285503 -0.135521 -0.8831421 0.1755209 0.5286359 0.2494099 -0.7104517 0.4698759 0.1169795 -0.1041754 0.1201675 0.4542837 -0.1131769 -0.2757284 -0.2428408 0.1884833 -0.039126 0.0402855 -0.0139469 0.0518669 -0.024001 0.0251721 -0.0376993 0.0455949 0.1752798 -0.0023618 0.046454 -0.0305494 0.0033063 0.0101806 0.0176533 0.0219371 0.0256875 0.1040525 0.0439785 0.0348403 -0.0189321 -0.0090933 0.086876 0.0018215 -0.0342551 -0.0104996 0.141011 0.098593 0.0066628 -0.00908 0.0218271 -0.0492262 -0.063565 -0.0062978 -0.0460224 -0.0291381 -0.041233 0.0428324 -0.0329789 0.0705224 0.0364423 -0.0005371 -0.0213863 -0.0026588 0.0915544 1.6999835 0.840573 -0.0509813 0.8131361 0.8391962 -0.2941531 0.1284805 -0.1916308 1.4162439 0.0828804 0.0011003 -0.021633 -0.0153537 -0.0144121 -0.0721396 0.0460746 -0.04014 -0.0488308 0.043903 -0.0035801 -0.0067055 0.0090381 0.030611 -0.0613596 -0.036316 -0.095615 -0.1653459 -0.0278448 -0.101015 0.0580265 -0.0788119 -0.0521752 0.0731099 0.0818135 0.091548 0.0042601 0.0051282 -0.0806155 0.1290826 -0.0816216 -0.0224403 0.052984 0.1133579 0.0521009 -0.0958897 -0.1279768 0.0525742 -0.0788247 0.0337525 0.0480646 -0.0315196 -0.0627016 -0.0263221 0.0350673 0.0335528 0.0067928 -0.0575826 0.0174081 0.0373226 -0.0401559 -0.0392318 -0.0775432 -0.1589957 -0.0269464 -0.099047 0.0626722 -0.090817 -0.044977 0.0591845 0.0726799 0.0924218 0.010261 0.1853789 -0.1096049 -0.0391115 -0.1337515 0.268487 -0.0013989 -0.0187129 0.031371 0.0470109 -0.1602486 -0.03355 -0.0892962 0.0015156 0.1092393 0.0010925 -0.0686955 -0.012874 0.0350937 0.0656523 0.0970989 -0.0038571 0.0756358 -0.1875389 -0.0040997 -0.0132632 0.0215542 0.0867014 0.0071726 -0.0488002 0.0975747 -0.0673388 0.0746406 0.1070777 0.0979619 0.0540482 -0.084236 -0.0382004 -0.0717663 0.0535796 -0.137084 -0.0080053 0.0915422 0.0879831 0.0892828 0.0118482 0.0050408 0.0953277 0.0003044 0.1417408 -0.1624563 -0.0296288 0.0063579 -0.0366708 0.0915729 0.0567376 0.0042289 -0.0044086 -0.026354 0.080681 -0.0739082 -0.0656466 -0.0471702 -0.173934 0.2102952 -0.073981 -0.0760804 -0.0917333 0.3275382 0.0591281 -0.0622008 0.0516035 0.1046362 0.2502849 -0.0741651 -0.0371082 -0.0852178 0.3361559 0.0395038 -0.0339888 0.0397601 0.1766115 unknown
polarizability: 102.7012914|5.8683488|89.8643543|-0.1419287|-3.3371305|86.6873631 unknown
InChI: InChI=1S/C7H16N2O/c1-3-5-6(4-2)9-7(8)10/h6,9H,3-5,8H2,1-2H3
charge 0 multiplicity 1
26 atoms
O  -2.285891 -0.773572 -1.089117
N  -0.665733 -0.23116 0.512645
N  -2.587457 -1.453702 1.122084
C  0.1941 0.505155 -0.439725
C  1.683278 0.312526 -0.061824
C  -0.220918 1.999859 -0.55647
C  2.191335 -1.133056 -0.263304
C  -0.070108 2.819715 0.743348
C  3.662538 -1.316006 0.166344
C  -1.865569 -0.811628 0.10914
H  0.010532 0.038464 -1.426651
H  1.850942 0.619235 0.993083
H  2.28876 1.005002 -0.680438
H  0.386294 2.462661 -1.360642
H  -1.27351 2.028377 -0.89631
H  2.07729 -1.408504 -1.331009
H  1.543697 -1.830635 0.30347
H  -0.410906 -0.207826 1.500959
H  0.982415 2.877691 1.077209
H  -0.428432 3.854607 0.595396
H  -0.668129 2.379707 1.564011
H  4.331788 -0.647335 -0.407723
H  4.003838 -2.354726 0.003242
H  3.797024 -1.081155 1.239667
H  -2.250262 -1.572667 2.074714
H  -3.466319 -1.885325 0.8494
