program: Gaussian 09
title: 000291893
version: EM64L-G09RevD.01
frameworkgroup: C1[X(C6H9Cl3O2)]
method: RPBEPBE
basis: SDD
operation: Freq
keyword: #p
keyword: freq=noraman
keyword: PBEPBE/SDD
title: #p freq=noraman PBEPBE/SDD
converged: YES YES NO NO
title: Mulliken charges:
elementType: Cl Cl Cl O O C C C C C C H H H H H H H H H
charge: -0.033695 -0.034727 -0.043878 -0.232696 -0.248008 -0.302130 -0.327153 -0.279018 -0.556479 0.292540 -0.748694 0.335486 0.313898 0.236410 0.278555 0.293652 0.299064 0.256452 0.252517 0.247906
chargesum: 0.00000
title: Mulliken charges with hydrogens summed into heavy atoms:
elementType: Cl Cl Cl O O C C C C C C
charge: -0.033695 -0.034727 -0.043878 -0.232696 -0.248008 0.033356 -0.013255 0.235947 0.036237 0.292540 0.008180
polarizability: 1.01777537e+02 -8.11239049e+00 1.07107989e+02 -2.76069106e+00 -1.87245720e+00 8.28592266e+01
1716.lowfreq: -4.2262 -0.0026 -0.0015 -0.0011 7.9465 8.1928 28.0057 33.4360 39.9550
frequency: 27.6982 33.3774 39.9350 64.0751 69.5875 97.8660 146.3117 161.9426 207.6634 209.9136 276.0361 299.8967 363.4809 424.5942 460.1114 505.0380 566.9530 596.2333 629.2606 659.3091 697.4816 785.0360 887.6941 940.7230 984.4717 1001.5248 1016.4021 1043.7336 1073.9355 1119.7613 1153.1521 1178.0269 1199.9903 1220.5315 1270.9323 1279.2147 1281.6501 1344.5691 1375.6441 1387.1435 1431.8160 1444.5050 1451.8168 1452.8047 1654.2485 3009.7404 3015.1312 3064.1990 3071.2785 3082.0481 3097.2574 3134.3171 3145.7695 3173.1436
redmass: 1.4208 2.9646 10.3864 11.2021 4.2516 5.8126 11.3387 7.3858 4.4814 6.4106 12.0637 3.1193 2.9848 4.4744 3.3228 4.8009 3.1988 5.4181 5.0762 6.0845 3.7160 4.4839 1.9171 2.5354 2.2229 2.5142 2.1625 1.6678 4.3170 1.5684 1.3052 1.2715 2.9578 1.3208 1.2090 1.1420 1.2316 1.4765 1.2697 1.2704 1.0887 1.0931 1.0553 1.0523 8.9182 1.0370 1.0646 1.0850 1.0858 1.0568 1.0971 1.0992 1.1011 1.1122
irintensity: 1.0673 1.2136 0.3289 2.3203 1.6944 3.0860 0.9339 8.8844 3.5543 0.8975 0.9585 12.8132 19.7705 11.3553 1.8765 9.9300 4.9790 25.5107 16.3442 57.6849 13.5405 24.2042 11.3871 7.3659 15.3337 107.1831 22.1832 10.3018 9.4165 0.2543 27.6055 2.8774 228.7448 59.0918 8.0920 6.0652 18.4251 3.6119 3.3108 54.3325 20.0010 17.4816 24.8549 23.9539 148.4028 0.6816 16.2296 0.9262 1.3686 6.3808 5.3656 0.9666 8.0447 0.7879
temp: 298.150 k
press: 1.00000 atm
elementType: 17 17 17 8 8 6 6 6 6 6 6 1 1 1 1 1 1 1 1 1
symmnumber: 1
zpe: 378671.8 jmol-1
zpe.correction: 0.144228 hartree
zpe.thermalcorrener: 0.157623 hartree
zpe.thermalcorrenthalpy: 0.158567 hartree
zpe.thermalcorrgfe: 0.100453 hartree
zpe.sumelectzpe: -1763.800919 hartree
zpe.sumelectthermal: -1763.787524 hartree
zpe.sumelectthermalent: -1763.786580 hartree
zpe.sumelectthermalfe: -1763.844694 hartree
dipole: -1.0324 -0.7917 -0.5868
dipole: 1.4272
quadrupole: -74.4141 -93.9974 -89.3780
quadrupole: 0.4563 -3.3754 3.9285
quadrupole: 11.5157 -8.0676 -3.4481 0.4563 -3.3754 3.9285
hfenergy: -1763.9451472 hartree
pointgroup: C01 [X(C6H9Cl3O2)]
dipole: 0.4377172 0.3476519 0.0533616 debye
dipolederiv: -0.2483788 -0.060848 0.0374363 -0.0582262 -0.2626517 0.1649603 0.027014 0.2184937 -0.3978627 -0.2819439 0.0389376 -0.021515 0.0652622 -0.5296281 -0.2088834 0.0286321 -0.2324824 -0.2424222 -0.2137916 -0.0248641 -0.0175564 -0.0624607 -0.447143 -0.2121862 -0.0450236 -0.2258792 -0.315516 -1.1042353 0.2868965 0.2947066 0.4770479 -0.4902877 -0.2725384 0.4493735 -0.246659 -0.7379779 -0.6142654 0.1054681 -0.1810181 0.1525209 -0.3543151 0.0355952 0.1388957 -0.0943653 -0.9146175 0.03188 0.1050674 -0.0857229 0.1085886 0.1219444 -0.3759274 -0.0735871 -0.4028369 0.5176144 0.2646942 -0.1245247 0.0964895 -0.2326748 0.5776286 0.276758 -0.0459636 0.3329832 0.1660391 0.7241182 -0.1348721 -0.1512771 -0.2033436 0.2531692 0.1186017 0.0276299 0.0130564 0.0816036 0.044881 0.0317955 0.0226969 0.0700416 0.4563829 0.301373 0.0050312 0.2484159 0.3572978 1.220929 -0.4628327 -0.0428281 -0.6318538 0.4878078 0.1943026 -0.4915972 0.3010918 1.3877038 -0.3220269 0.1594296 -0.0797215 0.1860991 -0.0649421 0.0391907 -0.1555606 0.0791267 -0.0603495 0.1184691 0.0387935 0.0296528 0.0336781 0.0090705 0.0167691 0.0077705 0.0313204 -0.0118282 0.0413719 0.0127745 0.0153709 0.0251465 -0.0119824 0.0157056 0.0525398 0.0143431 -0.0247252 -0.0139106 -0.0106206 0.0493438 0.0194805 0.0238115 0.0585644 -0.0555408 0.1216056 0.0000064 0.0385027 0.0349397 0.0302057 0.0274658 0.0651165 -0.0507654 0.0091427 -0.0803646 0.0393246 -0.0064815 0.0450698 -0.047193 0.0683769 0.0045079 -0.0328819 -0.0490903 -0.0367027 0.0360449 0.1385438 -0.0042129 0.0124341 -0.0204707 0.0133097 -0.0412142 0.0789783 0.0099049 -0.0173962 0.0908733 -0.0457034 0.0459539 -0.0025028 0.0306975 0.0842947 0.0465784 0.0856374 0.0565772 0.0460382 -0.0346262 -0.0445014 -0.0799149 0.0226203 -0.0676818 -0.0390012 -0.0711938 0.0986861 0.0447326 0.0439326 0.0370428 0.0577394 0.0948831 -0.0440367 0.0837782 -0.0654953 -0.0182022 unknown
polarizability: 100.4276378|-8.5813362|95.24024|-2.3994249|12.3357972|96.0768742 unknown
InChI: InChI=1S/C6H9Cl3O2/c1-4(10)11-3-6(9)5(8)2-7/h5-6H,2-3H2,1H3
charge 0 multiplicity 1
20 atoms
Cl -0.912665 -0.9611 1.883561
Cl -2.355475 2.049901 0.789047
Cl -2.756841 -1.677387 -1.669232
O  1.866052 0.18756 0.669956
O  2.023775 -0.272966 -1.610753
C  -0.573365 -0.089799 0.236692
C  -1.841209 0.572647 -0.306128
C  0.59079 0.89156 0.411931
C  -3.082178 -0.309823 -0.402955
C  2.502838 -0.363192 -0.458203
C  3.789229 -1.040677 -0.05407
H  -0.301016 -0.906679 -0.45245
H  -1.610822 1.033264 -1.282434
H  0.688385 1.501481 -0.506655
H  0.442182 1.536457 1.28906
H  -3.945211 0.251837 -0.78416
H  -3.307784 -0.812858 0.547013
H  3.577398 -1.853858 0.661771
H  4.454178 -0.322798 0.456092
H  4.29074 -1.448371 -0.943085
