program: Gaussian 09
title: 000291871
version: EM64L-G09RevD.01
frameworkgroup: C1[X(C6H3BrClNO3)]
method: RPBEPBE
basis: SDD
operation: Freq
keyword: #p
keyword: freq=noraman
keyword: PBEPBE/SDD
title: #p freq=noraman PBEPBE/SDD
converged: NO YES NO NO
title: Mulliken charges:
elementType: Br Cl O O O N C C C C C C H H H
charge: 0.100458 -0.015049 -0.356591 -0.171060 -0.259239 0.031344 0.326426 0.293058 -0.334118 -0.334379 -0.088463 -0.170340 0.313300 0.285944 0.378710
chargesum: 0.00000
title: Mulliken charges with hydrogens summed into heavy atoms:
elementType: Br Cl O O O N C C C C C C
charge: 0.100458 -0.015049 0.022119 -0.171060 -0.259239 0.031344 0.326426 0.293058 -0.020818 -0.334379 -0.088463 0.115604
polarizability: 1.64641758e+02 1.73999462e+00 1.46109411e+02 -6.06768545e-03 -5.08608891e-03 3.76376083e+01
1716.lowfreq: -4.1325 0.0020 0.0023 0.0031 5.3678 8.2734 67.4731 108.1607 137.2559
frequency: 67.4721 108.1601 137.2556 139.7343 165.5541 187.8968 265.4615 335.4851 344.8235 350.7792 391.9621 427.0413 461.3164 547.4182 593.5026 671.9744 679.4166 702.3663 721.5978 798.7885 849.5514 856.0756 884.3154 904.3298 1070.6223 1102.5805 1154.0600 1165.7254 1260.9246 1298.2548 1355.2141 1392.5857 1409.6715 1482.2175 1553.7124 1602.1095 2940.6506 3185.0731 3193.5651
redmass: 13.1455 15.2168 10.8812 20.7333 23.2226 4.7693 16.3977 8.9333 7.2036 14.6596 7.9159 11.0738 5.4547 3.7542 6.1676 9.5537 10.7497 10.8724 8.0827 8.4159 1.0661 8.7065 1.4327 1.3552 2.3252 4.1695 6.5712 1.8467 2.8387 1.9821 6.1256 4.7254 3.8438 3.6738 5.4252 6.8893 1.0661 1.0933 1.0931
irintensity: 0.2343 0.0971 1.2628 0.0087 0.8622 1.7535 3.0399 0.1602 14.7022 0.9456 1.7065 1.5403 6.4245 11.4051 9.1393 0.5388 33.5980 64.1295 15.6735 4.4351 146.7676 18.9631 23.2712 6.6443 12.9642 16.9345 365.6377 45.9226 124.7234 165.5242 101.2313 108.5108 85.0173 90.1141 2.3245 16.1151 177.0499 1.1507 13.8074
temp: 298.150 k
press: 1.00000 atm
elementType: 35 17 8 8 8 7 6 6 6 6 6 6 1 1 1
symmnumber: 1
zpe: 219869.1 jmol-1
zpe.correction: 0.083744 hartree
zpe.thermalcorrener: 0.094331 hartree
zpe.thermalcorrenthalpy: 0.095275 hartree
zpe.thermalcorrgfe: 0.045633 hartree
zpe.sumelectzpe: -983.430901 hartree
zpe.sumelectthermal: -983.420314 hartree
zpe.sumelectthermalent: -983.419370 hartree
zpe.sumelectthermalfe: -983.469012 hartree
dipole: -1.0778 2.1064 0.0001
dipole: 2.3661
quadrupole: -91.5402 -90.3636 -84.5582
quadrupole: 2.8408 0.0019 -0.0028
quadrupole: -2.7195 -1.5429 4.2625 2.8408 0.0019 -0.0028
hfenergy: -983.5146449 hartree
pointgroup: C01 [X(C6H3Br1Cl1N1O3)]
dipole: 0.9263587 -0.0903461 0.0172105 debye
dipolederiv: -0.1060475 -0.27123 0.0043528 -0.2325289 -0.4669498 0.0085523 0.0033773 0.0077706 0.0350302 -0.3449068 0.3105526 -0.0126026 0.3695552 -0.5370866 0.0182448 -0.0140627 0.0173734 -0.0393377 -0.6115531 0.4724729 -0.0156954 0.3149011 -0.8602201 0.0172515 -0.0117884 0.0199375 -0.3478947 -0.6532181 -0.2463893 -0.0013903 -0.4138703 -0.7656697 0.0066731 0.0028457 0.0096884 -0.2022548 -0.7710942 0.1349462 -0.0113683 0.3672489 -0.6178546 0.0143709 -0.0167857 0.010467 -0.2666253 1.9274767 0.3195056 0.0199827 0.1866516 1.0785138 -0.0175944 0.0230483 -0.0156247 0.2110951 -0.9810233 -0.3752133 -0.0071294 0.0278536 -0.0103483 0.001205 -0.017224 -0.0056888 0.0273142 0.4814276 -0.7398135 0.0228524 -0.3383566 0.46243 -0.0122657 0.0133017 -0.0182398 0.1678815 0.1847866 0.3191564 -0.0039445 -0.2199242 -0.3411724 0.0035157 0.009074 0.0123936 -0.0537054 0.1589903 0.8672027 -0.015774 0.538466 0.8633725 -0.0166521 -0.0078278 -0.0114663 -0.1689905 0.17165 -0.7325016 0.0221484 -0.7899602 0.7303969 -0.032899 0.0236524 -0.0321371 -0.0817 -0.0121284 -0.0102918 -0.0001192 0.247275 -0.1898934 0.008937 -0.0064392 0.004776 0.0049174 0.1249828 -0.0422097 0.0000809 0.0198403 0.109702 0.0020973 -0.0014264 0.0011464 0.1828452 0.0359985 -0.018885 -0.0014815 -0.002956 0.1177715 0.000913 -0.0018727 0.0006962 0.1570327 0.394659 0.0126977 0.0000879 -0.0741956 0.4270081 -0.0023493 0.0021275 -0.0010923 0.3743922 unknown
polarizability: 149.9050206|7.7401581|160.7500952|1.6217934|-2.8718635|37.7336612 unknown
InChI: InChI=1S/C6H3BrClNO3/c7-4-1-3(8)2-5(6(4)10)9(11)12/h1-2,10H
charge 0 multiplicity 1
15 atoms
Br 2.113789 2.882154 -0.068903
Cl 2.532754 -2.768188 0.076327
O  -0.875987 2.188704 -0.09919
O  -2.673419 -1.612601 -0.036897
O  -2.905657 0.654015 -0.094862
N  -2.161496 -0.438351 -0.0571
C  -0.710785 -0.27599 -0.037427
C  -0.138382 1.042592 -0.059939
C  0.08583 -1.448068 0.003899
C  1.28606 1.129311 -0.039274
C  1.472091 -1.29882 0.022824
C  2.087067 -0.021217 0.001573
H  -0.401387 -2.425408 0.019698
H  3.176153 0.067382 0.016802
H  -1.865631 1.915483 -0.107934
