program: Gaussian 09
title: 000291867
version: EM64L-G09RevD.01
frameworkgroup: C1[X(C8H6N2O3)]
method: RPBEPBE
basis: SDD
operation: Freq
keyword: #pfreq=noraman
keyword: PBEPBE/SDD
title: #p freq=noraman PBEPBE/SDD
converged: NO YES NO NO
title: Mulliken charges:
elementType: O O O N N C C C C C C C C H H H H H H
charge: -0.255501 -0.194789 -0.193112 0.026507 -0.009678 0.255955 0.424806 -0.486959 0.284499 -0.390741 -0.316940 -0.520550 -0.251317 0.314396 0.296239 0.269548 0.248613 0.248435 0.250588
chargesum: 0.00000
title: Mulliken charges with hydrogens summed into heavy atoms:
elementType: O O O N N C C C C C C C C
charge: -0.255501 -0.194789 -0.193112 0.026507 -0.009678 0.255955 0.424806 -0.172563 0.284499 -0.094501 -0.047392 0.227086 -0.251317
polarizability: 1.81121511e+02 -4.99434274e+00 1.22893961e+02 -2.05849041e-02 -3.09324598e-02 4.67746813e+01
1716.lowfreq: -4.2046 -0.0009 -0.0007 0.0001 1.5182 9.6164 39.7738 61.2930 79.5861
frequency: 39.7603 61.2910 79.5838 144.2401 187.8340 195.8203 230.8202 253.2305 265.5785 323.1572 360.9769 412.2445 473.8444 515.0011 517.8819 560.1373 603.4278 639.3340 694.6484 703.7758 737.0788 745.5817 845.5594 862.5811 927.7849 982.3927 998.9974 1067.7043 1104.7513 1115.9061 1155.3687 1184.4694 1211.2695 1230.7931 1260.1395 1372.4129 1386.6026 1400.9858 1445.5630 1462.6194 1471.4871 1473.5410 1576.6728 1613.9624 2167.8374 3000.3768 3106.7818 3141.2431 3164.5820 3194.2119 3199.5566
redmass: 4.2025 7.8542 7.4724 11.6200 5.9151 3.6120 1.8158 2.2147 3.8667 12.4505 6.7843 4.4484 9.2242 7.4641 5.2608 5.3704 8.4927 5.6025 6.3475 5.8122 3.9835 10.4502 1.4583 7.7224 1.4917 1.3411 5.9447 2.1157 1.2545 1.8450 1.3121 3.0059 9.5017 3.7547 1.3909 6.1756 9.1396 3.5993 1.5466 1.0855 1.0483 2.0997 8.9853 7.1000 12.6270 1.0303 1.1056 1.1033 1.0911 1.0923 1.0960
irintensity: 8.8451 3.9682 1.2804 5.8965 0.9026 3.0105 0.1676 0.6504 5.2847 0.1330 3.4698 0.2020 3.0657 3.7477 4.5988 1.7208 1.4571 2.9594 1.9886 24.2791 0.7417 34.1455 32.5665 25.8833 38.2472 0.1518 43.5873 13.6017 0.0006 12.3991 9.8031 28.6115 191.4512 187.9520 18.8845 24.6219 25.8559 214.3291 5.5382 12.1642 19.1017 113.0214 22.0318 23.6752 22.4736 31.0054 21.9705 14.4886 1.8648 9.3357 5.1131
temp: 298.150 k
press: 1.00000 atm
elementType: 8 8 8 7 7 6 6 6 6 6 6 6 6 1 1 1 1 1 1
symmnumber: 1
zpe: 340166.5 jmol-1
zpe.correction: 0.129563 hartree
zpe.thermalcorrener: 0.141173 hartree
zpe.thermalcorrenthalpy: 0.142117 hartree
zpe.thermalcorrgfe: 0.090938 hartree
zpe.sumelectzpe: -642.582824 hartree
zpe.sumelectthermal: -642.571213 hartree
zpe.sumelectthermalent: -642.570269 hartree
zpe.sumelectthermalfe: -642.621449 hartree
dipole: 2.8650 0.3716 0.0069
dipole: 2.8890
quadrupole: -96.7152 -72.1454 -73.9643
quadrupole: 13.6017 0.0241 0.0083
quadrupole: -15.7736 8.7962 6.9774 13.6017 0.0241 0.0083
hfenergy: -642.7123863 hartree
pointgroup: C01 [X(C8H6N2O3)]
dipole: -1.0876501 0.2982731 0.1412159 debye
dipolederiv: -0.821202 0.6734463 0.0492652 0.7133057 -1.1076772 -0.0707379 0.0477649 -0.0656831 -0.2994997 -0.7590143 0.1955845 0.0701161 0.1529724 -0.6204294 -0.0074935 0.0717004 -0.0135037 -0.2284401 -0.6968922 -0.16946 0.0744912 -0.179336 -0.6746097 0.0419144 0.0749565 0.0406314 -0.2295278 1.7734388 0.0022924 -0.2261926 0.0807319 1.0976398 -0.043845 -0.2292033 -0.0330138 0.2234626 -0.3783846 -0.072602 0.0232063 -0.0235342 -0.2715885 0.0048038 0.0214501 0.0118394 -0.2376376 0.3743512 -0.7273715 -0.0079671 -0.7680579 1.0985427 0.0725158 -0.0063128 0.0674026 0.126597 -0.5505723 -0.0736981 0.0917632 0.0386449 0.3538456 -0.0160754 0.087663 0.0001307 0.0608653 -0.1118747 0.4861069 -0.0201559 -0.107894 -0.2148691 0.0188437 0.0017012 -0.0657212 -0.1233934 -0.0924907 -0.1893876 0.0270069 0.3084975 -0.0459098 -0.0402532 0.008179 0.0304636 0.0454574 -0.1407276 -0.2359235 0.0088451 0.1165915 -0.2254669 -0.0133986 -0.0038754 0.0367692 -0.1406017 0.0730532 0.2063557 -0.0325928 -0.1197501 0.0691764 0.0108516 -0.0205337 -0.0358599 -0.0980547 0.697835 -0.3725042 -0.0441429 -0.1224344 0.2855351 0.0173693 -0.0531797 0.052657 0.2917145 0.3345438 0.1470669 -0.0474347 0.0178943 0.0312472 -0.0022952 -0.0425664 -0.0208221 0.0474033 0.1440915 -0.0265404 0.0071119 0.000108 0.0995273 0.0032504 0.0061699 0.0071548 0.1856803 0.1039157 0.0495475 0.0098595 0.0170559 0.0863557 0.0012393 0.0109023 -0.003395 0.1844001 0.0545303 -0.0575471 0.0169457 -0.0432757 0.0052646 0.0118198 0.0164822 0.0138807 0.1555257 -0.0225471 0.0844337 0.0192422 -0.0638777 0.0790695 0.1008346 0.0514223 0.0522551 -0.0644324 -0.0441333 0.0635941 -0.0286839 -0.0944807 0.0664943 -0.0878208 -0.0496917 -0.0822198 -0.030735 0.0620795 0.0166064 0.0093165 0.0768384 -0.1121478 -0.0015233 0.0069712 0.0070341 0.1312162 unknown
polarizability: 178.7346638|-3.4183171|122.5264433|-18.7045788|-2.3086739|49.529047 unknown
InChI: InChI=1S/C8H6N2O3/c1-13-8-4-7(10(11)12)3-2-6(8)5-9/h2-4H,1H3
charge 0 multiplicity 1
19 atoms
O  -1.166548 2.106966 0.236683
O  3.767519 -1.193312 -0.345924
O  3.582695 1.080112 -0.40096
N  3.081938 -0.102269 -0.287043
N  -3.716744 -0.930911 0.715117
C  -0.55269 0.865815 0.195835
C  1.610866 -0.222779 -0.07253
C  0.849667 0.949835 -0.007022
C  -1.161792 -0.426647 0.330271
C  1.044551 -1.512667 0.055294
C  -0.338106 -1.59449 0.255558
C  -2.620408 2.266291 0.434884
C  -2.566366 -0.650664 0.53955
H  1.320147 1.930138 -0.110569
H  1.679271 -2.398787 -0.002692
H  -0.820504 -2.570907 0.360385
H  -2.936688 1.85704 1.409085
H  -3.187851 1.78882 -0.381636
H  -2.775258 3.354316 0.415214
