program: Gaussian 09
title: 000291904
version: EM64L-G09RevD.01
frameworkgroup: C1[X(C6H10O9S3)]
method: RPBEPBE
basis: SDD
operation: Freq
keyword: #p
keyword: freq=noraman
keyword: PBEPBE/SDD
title: #p freq=noraman PBEPBE/SDD
converged: YES YES NO NO
title: Mulliken charges:
elementType: S S S O O O O O O O O O C C C C C C H H H H H H H H H H
charge: 0.985594 0.979162 0.969422 -0.467625 -0.422685 -0.403188 -0.398266 -0.409412 -0.445010 -0.500275 -0.537893 -0.536258 0.017031 -0.032547 -0.356938 -0.380380 -0.341371 -0.310559 0.243544 0.250018 0.252482 0.240108 0.272398 0.289541 0.228046 0.273781 0.283942 0.257338
chargesum: 0.00000
title: Mulliken charges with hydrogens summed into heavy atoms:
elementType: S S S O O O O O O O O O C C C C C C
charge: 0.985594 0.979162 0.969422 -0.467625 -0.422685 -0.403188 -0.398266 -0.409412 -0.445010 -0.500275 -0.537893 -0.536258 0.260575 0.217471 0.135652 0.181559 0.160456 0.230721
polarizability: 1.85775904e+02 -1.88625293e+00 1.79623184e+02 9.14129278e+00 5.32402363e-01 1.33132945e+02
1716.lowfreq: -8.0585 -2.2012 -0.0010 0.0014 0.0030 3.3157 27.7690 31.0424 40.7070
frequency: 27.7354 30.9202 40.6982 54.7237 59.5457 70.7689 88.8251 96.4438 104.8672 145.0770 160.1617 163.7535 173.4680 200.0518 227.3443 247.2297 260.0528 294.8253 313.1744 332.0606 338.6443 368.2697 396.3803 426.9870 433.3644 448.6626 475.8378 486.8400 507.6291 513.9336 516.6347 526.1537 568.9629 582.1932 598.9600 797.7345 812.0388 891.3328 898.4862 901.8596 908.8795 913.8886 923.4770 925.1679 948.9319 954.0062 983.8229 1020.0099 1055.1814 1087.7417 1088.3435 1103.6311 1164.2154 1178.0753 1209.8301 1242.0926 1255.2479 1272.1430 1305.7973 1319.6560 1333.3521 1349.8385 1356.7741 1360.2843 1442.3694 1448.0175 1449.9526 1466.4790 2953.5368 2993.3821 3016.8456 3017.9015 3018.7228 3029.6156 3042.0822 3092.2084 3099.6267 3122.4504
redmass: 10.5101 7.5041 11.3889 9.1109 10.6295 7.6596 11.8535 4.9108 9.5717 6.8261 3.7982 3.8469 8.5295 5.8981 5.2189 9.9191 8.4209 9.6346 9.0771 9.8991 7.4531 5.1093 5.1852 4.4658 4.4540 3.8017 6.9317 7.6192 11.5320 9.6959 11.8386 10.9528 7.8518 3.7109 6.0868 3.7665 3.4391 4.7292 4.8180 3.9905 4.2316 2.2510 10.2208 8.0021 18.0591 7.7408 2.2408 4.3787 2.4687 2.6560 1.9408 2.9212 1.1532 1.1715 1.2203 1.1092 1.2083 1.1485 1.2187 1.2090 1.1900 1.2360 1.2975 1.3173 1.0784 1.0760 1.0780 1.0754 1.0583 1.0631 1.0662 1.0788 1.0632 1.0986 1.0850 1.1032 1.1098 1.1052
irintensity: 0.2212 0.3674 0.9614 0.4339 0.0993 1.9338 5.0193 1.7036 5.2673 0.9120 4.1209 5.9341 4.5624 3.2447 2.9264 6.8420 11.4120 11.0676 21.5932 43.2220 25.3321 23.4764 8.1339 43.8195 25.0043 16.2829 11.8691 12.1069 22.2909 36.9493 105.3468 50.7542 33.7308 44.9808 28.3824 27.8243 22.1519 4.7815 48.2179 38.0536 45.5731 25.7942 117.5241 62.7440 75.3196 31.6715 18.9603 13.8257 6.6010 8.4534 4.5041 1.8400 3.5566 3.9378 5.0662 5.5381 2.1760 4.3572 2.8651 8.9501 6.4284 10.5966 9.7276 1.0494 0.5081 23.1937 5.7933 7.2413 15.1866 26.6286 14.2731 16.8387 9.6230 26.1907 26.1517 7.9165 7.4796 0.9963
temp: 298.150 k
press: 1.00000 atm
elementType: 16 16 16 8 8 8 8 8 8 8 8 8 6 6 6 6 6 6 1 1 1 1 1 1 1 1 1 1
symmnumber: 1
zpe: 466760.2 jmol-1
zpe.correction: 0.177780 hartree
zpe.thermalcorrener: 0.198291 hartree
zpe.thermalcorrenthalpy: 0.199235 hartree
zpe.thermalcorrgfe: 0.126299 hartree
zpe.sumelectzpe: -2104.086554 hartree
zpe.sumelectthermal: -2104.066043 hartree
zpe.sumelectthermalent: -2104.065099 hartree
zpe.sumelectthermalfe: -2104.138035 hartree
dipole: -1.7580 -1.6027 -2.4893
dipole: 3.4433
quadrupole: -113.3338 -127.5976 -136.4761
quadrupole: -7.5979 3.7134 -3.4146
quadrupole: 12.4687 -1.7951 -10.6736 -7.5979 3.7134 -3.4146
hfenergy: -2104.2643337 hartree
pointgroup: C01 [X(C6H10O9S3)]
dipole: 0.0526073 -0.7566841 -1.1224186 debye
polarizability: 184.7653334|-3.4866747|132.1320853|-4.2159157|-3.7585831|181.6346144 unknown
InChI: InChI=1S/C6H10O9S3/c7-16(10-1-5-3-12-17(8)14-5)11-2-6-4-13-18(9)15-6/h5-6H,1-4H2
charge 0 multiplicity 1
28 atoms
S  1.391236 0.192299 2.456904
S  -2.822317 -0.180627 2.701617
S  -0.22511 1.166427 -3.093053
O  0.9113 0.102425 0.579063
O  -2.980016 1.128201 1.354075
O  3.097099 -0.446896 1.961564
O  -3.018979 -1.488036 1.389531
O  1.105282 -0.040854 -2.486405
O  -1.696562 0.693538 -2.077047
O  1.500157 1.766649 2.708692
O  -1.277817 -0.133028 3.153273
O  0.263096 2.606683 -2.548557
C  2.094384 -0.269267 -0.23308
C  -2.830377 0.503379 0.005614
C  3.35791 0.058261 0.60384
C  -2.330806 -0.953421 0.185606
C  2.07913 0.528929 -1.543778
C  -1.819093 1.372523 -0.75752
H  2.052873 -1.355538 -0.440385
H  -3.826224 0.518785 -0.471519
H  4.243997 -0.493989 0.249557
H  3.563299 1.146988 0.622729
H  -2.651968 -1.605718 -0.640171
H  -1.233221 -0.989312 0.311583
H  3.067582 0.453834 -2.03852
H  1.858226 1.600415 -1.34798
H  -0.853093 1.381733 -0.221947
H  -2.192189 2.400917 -0.895782
