program: Gaussian 09
title: 000291870
version: EM64L-G09RevD.01
frameworkgroup: C1[X(C5H8O2S3)]
method: RPBEPBE
basis: SDD
operation: Freq
keyword: #pfreq=noraman
keyword: PBEPBE/SDD
title: #p freq=noraman PBEPBE/SDD
converged: YES YES NO NO
title: Mulliken charges:
elementType: S S S O O C C C C C H H H H H H H H
charge: 0.333073 0.348601 0.179698 -0.406333 -0.206847 -0.576278 -0.644022 -0.695973 -0.777471 0.245240 0.273417 0.255856 0.232566 0.242352 0.226636 0.284912 0.293074 0.391499
chargesum: 0.00000
title: Mulliken charges with hydrogens summed into heavy atoms:
elementType: S S S O O C C C C C
charge: 0.333073 0.348601 0.179698 -0.014834 -0.206847 -0.047005 0.057532 -0.117987 -0.777471 0.245240
polarizability: 1.36194764e+02 -8.12418183e+00 1.44880422e+02 -8.75246974e+00 -1.73035654e-01 8.28561089e+01
1716.lowfreq: -3.5530 0.0013 0.0014 0.0020 6.8452 8.9519 31.6063 37.4941 42.1574
frequency: 31.4356 37.4762 42.0432 59.6052 78.7351 128.7525 156.1731 173.7028 241.3506 256.7479 307.8166 327.4566 399.5179 437.1812 457.6493 515.0745 563.0220 588.6918 635.0597 729.8642 761.3703 792.7144 848.7970 888.4085 980.5244 1009.9478 1036.9724 1060.8832 1067.2204 1172.2773 1229.7251 1245.6666 1265.0215 1309.3458 1398.2362 1425.6056 1453.4709 1466.1450 1478.5823 1666.5518 2986.8232 3024.4519 3057.8954 3079.1512 3090.9568 3115.7420 3151.0188 3522.2050
redmass: 7.9022 10.1540 3.4655 4.5073 3.6416 4.1695 4.7803 5.3588 1.3922 4.6158 4.5219 8.4186 2.7390 14.5620 10.5909 4.3326 3.1961 5.3183 1.4855 6.0599 2.7681 1.5795 5.9066 1.7474 1.7769 5.5831 1.3492 1.8090 2.3481 1.2046 1.1917 1.2224 1.2255 2.3329 1.1929 1.1045 1.0873 1.0389 1.0470 8.8876 1.0367 1.0575 1.0558 1.0975 1.1034 1.1056 1.1100 1.0642
irintensity: 0.0491 1.0895 0.0639 0.5276 1.0974 0.9552 0.3217 0.4699 0.1665 0.7989 0.7671 0.4441 5.4236 8.9193 11.3814 38.7305 38.0186 6.0167 132.1864 18.5109 107.0248 38.5555 28.0722 25.1942 53.1609 123.9738 7.0734 250.4316 29.5359 47.8239 4.4625 0.9294 14.0089 76.1527 15.1836 22.1347 2.4431 16.5572 9.9377 255.2180 25.8728 9.2493 6.6661 19.5915 1.1943 27.2486 0.7001 39.3506
temp: 298.150 k
press: 1.00000 atm
elementType: 16 16 16 8 8 6 6 6 6 6 1 1 1 1 1 1 1 1
symmnumber: 1
zpe: 327496.1 jmol-1
zpe.correction: 0.124737 hartree
zpe.thermalcorrener: 0.137646 hartree
zpe.thermalcorrenthalpy: 0.138590 hartree
zpe.thermalcorrgfe: 0.082247 hartree
zpe.sumelectzpe: -1539.160464 hartree
zpe.sumelectthermal: -1539.147555 hartree
zpe.sumelectthermalent: -1539.146611 hartree
zpe.sumelectthermalfe: -1539.202954 hartree
dipole: 0.1927 -4.7593 -1.7054
dipole: 5.0593
quadrupole: -74.5476 -80.4530 -88.2991
quadrupole: 5.3415 -3.4888 0.1642
quadrupole: 6.5523 0.6468 -7.1992 5.3415 -3.4888 0.1642
hfenergy: -1539.2852006 hartree
pointgroup: C01 [X(C5H8O2S3)]
dipole: 0.3401649 1.8435151 -0.6691098 debye
dipolederiv: -0.3649706 -0.2306126 -0.0753077 -0.3519335 -0.4652558 -0.1968236 -0.2606341 -0.2301632 -0.0458192 -0.3647407 0.1234086 -0.142027 0.0853701 -0.1159813 0.2129708 -0.3549724 0.2063237 -0.0320413 -0.2359157 0.0748513 -0.0728039 0.0650053 -0.9654316 0.0248595 -0.1562612 0.0275239 -0.0489074 -0.6959613 0.2460876 -0.4701745 0.1326193 -0.4315191 0.1029964 -0.4638422 0.1853005 -0.9127417 -0.8076655 0.1310015 0.2585404 -0.0837558 -0.2356592 0.1074488 0.1343755 -0.0033594 -0.8476459 0.0856549 0.0103995 -0.1452887 0.2021853 0.395488 -0.0375747 -0.2113316 -0.1445889 0.036226 -0.0323898 0.0066459 0.0124894 -0.1603603 -0.1114899 0.006373 0.1035991 0.1007074 0.0689355 -0.4200206 0.1886457 -0.0704312 0.046217 0.1057525 -0.0238397 -0.0044675 -0.0159798 -0.0655723 0.750823 -0.0198195 0.5172284 0.0153451 1.3715904 0.0108311 0.8956382 0.0644896 0.0190541 1.6542397 -0.4581206 0.0846032 0.0518154 0.1027431 -0.235611 0.1391798 -0.2259795 1.4411638 0.0368141 -0.0092943 -0.0739206 -0.0346123 0.0045881 -0.0048823 -0.0348159 0.0248234 -0.0402849 -0.0241248 0.0682508 0.0633275 0.0285691 -0.1004569 -0.0150451 0.0907547 0.0073597 0.0382639 0.0503727 -0.017768 -0.0334156 0.0104062 0.1201331 -0.0183799 -0.10908 -0.0567396 -0.093553 0.0364326 0.0455636 0.0443391 0.1217525 -0.0013404 -0.0834599 0.036963 -0.0763849 0.0596289 0.0096871 -0.0929322 0.0108247 -0.0733733 -0.0787423 0.1060353 0.0355979 0.1269317 0.0536185 0.0690355 -0.0053553 0.0372672 -0.0019347 -0.0377985 0.0387275 0.042194 0.0381648 0.0688139 0.0748189 -0.016809 -0.0356224 0.0060128 0.0551626 -0.0122845 -0.021504 -0.0369109 0.0100107 0.1779104 -0.0441431 0.0903718 -0.0593282 0.388217 0.0176583 0.1386067 0.0084816 0.2908505 unknown
polarizability: 131.3970766|-5.5799001|147.496648|13.378181|-2.9747204|85.0375705 unknown
InChI: InChI=1S/C5H8O2S3/c1-2-9-5(8)10-3-4(6)7/h6H,2-3H2,1H3
charge 0 multiplicity 1
18 atoms
S  2.084061 -0.658566 1.164278
S  -0.286312 -0.982317 -0.913931
S  1.130794 -3.396438 0.241353
O  -3.040921 0.717263 -0.98686
O  -2.945487 0.29212 1.301168
C  2.361819 0.926559 0.111282
C  3.864634 1.226366 0.051611
C  -0.867195 0.601977 0.007706
C  0.985972 -1.724655 0.180478
C  -2.361391 0.513904 0.22108
H  1.941768 0.711649 -0.885924
H  1.795471 1.745647 0.583404
H  4.289672 1.393273 1.0569
H  4.418385 0.399661 -0.424287
H  4.034022 2.144492 -0.54249
H  -0.604136 1.471285 -0.612208
H  -0.35506 0.620185 0.980265
H  -4.020596 0.615796 -0.842126
